program: Orca
programVersion: 5.0.2
elementType: O O O C C C C C C C C C C C C C C C C C C C H H H H H H H H H H H H H H H H H H H H H H H H H H H H H H H H H H
charge: 0
multiplicity: 1
keywords: wb97x-d3
keywords: def2-TZVPP
keywords: def2/J RIJCOSX
keywords: DEFGRID2
keywords: scfconv7
keywords: smallprint printgap noloewdin
keywords: NOSOSCF
formula: C19H34O3
InChI: InChI=1/C19H34O3/c1-15(2)22-18(20)14-17(4)11-8-10-16(3)12-9-13-19(5,6)21-7/h8,11,14-16H,9-10,12-13H2,1-7H3
56 atoms
O  -4.367164 3.411414 1.458631
O  4.877284 -1.17014 -0.817054
O  4.356588 -1.998147 1.193875
C  -3.622101 1.047858 -0.225906
C  -3.026182 2.445072 -0.353588
C  -2.607718 -0.025217 -0.604667
C  -3.917996 3.603832 0.117282
C  -3.15659 -1.45173 -0.606625
C  -2.113356 -2.438398 -1.165437
C  -5.198806 3.674626 -0.706222
C  -3.151438 4.917792 -0.029866
C  -3.6613 -1.882578 0.766332
C  -0.88128 -2.538877 -0.331544
C  -3.392919 3.397829 2.469819
C  0.331239 -2.143667 -0.734342
C  1.54964 -2.19863 0.070606
C  1.433971 -2.744525 1.458137
C  2.680145 -1.739305 -0.508778
C  4.022064 -1.664976 0.077364
C  6.263999 -1.001627 -0.455828
C  7.047855 -1.055541 -1.749702
C  6.454675 0.310053 0.280693
H  -4.503758 0.95185 -0.867107
H  -3.96786 0.884724 0.79791
H  -2.767578 2.633484 -1.400423
H  -2.073704 2.476338 0.186816
H  -1.753686 0.035548 0.079207
H  -2.209849 0.198067 -1.60133
H  -4.005464 -1.485025 -1.299538
H  -1.848065 -2.143202 -2.184149
H  -2.577884 -3.428155 -1.232874
H  -5.792522 4.549316 -0.432924
H  -5.824512 2.792381 -0.564262
H  -4.967483 3.750592 -1.76929
H  -3.727845 5.759392 0.359717
H  -2.187948 4.900167 0.482611
H  -2.947856 5.117449 -1.08263
H  -2.901886 -1.749958 1.540389
H  -3.954176 -2.934775 0.767757
H  -4.53649 -1.307913 1.071289
H  -1.007925 -2.951325 0.664694
H  -3.904159 3.161198 3.403835
H  -2.896384 4.365184 2.602641
H  -2.615994 2.640565 2.319083
H  0.438032 -1.736154 -1.736111
H  2.375159 -2.757385 1.992688
H  0.721839 -2.152618 2.036461
H  1.043809 -3.763568 1.430326
H  2.609499 -1.37374 -1.526946
H  6.569355 -1.832246 0.184952
H  6.898731 -2.003406 -2.268248
H  6.768597 -0.244341 -2.424289
H  8.112784 -0.960487 -1.536455
H  6.160374 1.157843 -0.340497
H  7.50699 0.434848 0.538707
H  5.884263 0.348136 1.20872
elementType: O C H
totalener: -970.28840489 hartree
nucrepener: 1782.13499034 hartree
electener: -2752.42339523 hartree
oneelecener: -4856.69261106 hartree
twoeener: 2104.26921583 hartree
cpcmener: -0.02271889 hartree
kineticenergy: 965.60978184 hartree
xcener: -96.762396807629 hartree
chargesum: -0.0000000
charge: -0.412449 -0.293187 -0.489811 -0.132180 -0.262528 -0.205767 0.391544 0.129752 -0.137517 -0.321389 -0.337565 -0.341846 -0.138684 -0.127962 -0.154422 0.021012 -0.264630 -0.181869 0.470027 0.158023 -0.251929 -0.265598 0.075403 0.071437 0.090428 0.087766 0.072830 0.075257 0.043805 0.085011 0.099458 0.099560 0.095076 0.089761 0.103057 0.097620 0.097862 0.084747 0.098365 0.096825 0.127667 0.121305 0.093699 0.087204 0.110061 0.109438 0.103279 0.104520 0.112997 0.061684 0.095773 0.087866 0.089208 0.089353 0.095569 0.095081
qa: -0.4124 -0.2932 -0.4898 -0.1322 -0.2625 -0.2058 0.3915 0.1298 -0.1375 -0.3214 -0.3376 -0.3418 -0.1387 -0.1280 -0.1544 0.0210 -0.2646 -0.1819 0.4700 0.1580 -0.2519 -0.2656 0.0754 0.0714 0.0904 0.0878 0.0728 0.0753 0.0438 0.0850 0.0995 0.0996 0.0951 0.0898 0.1031 0.0976 0.0979 0.0847 0.0984 0.0968 0.1277 0.1213 0.0937 0.0872 0.1101 0.1094 0.1033 0.1045 0.1130 0.0617 0.0958 0.0879 0.0892 0.0894 0.0956 0.0951
va: 1.9293 2.1279 2.0103 3.8564 3.8523 3.9308 3.7804 3.7306 3.9187 3.9103 3.9168 3.9621 3.8585 3.9290 3.9120 3.6963 3.9195 3.7844 4.1737 3.8181 3.9317 3.9085 1.0106 1.0194 1.0134 1.0007 1.0068 1.0118 1.0187 1.0141 1.0052 1.0088 1.0070 1.0048 1.0075 0.9981 1.0062 0.9959 1.0031 1.0011 0.9942 0.9906 0.9851 0.9804 1.0240 1.0370 0.9963 0.9962 1.0341 1.0245 1.0085 1.0071 1.0056 1.0068 1.0060 1.0164
dispcorr: -0.024115157 hartree
energy: -970.312520046649
dipole: -16.75005 16.60080 -0.14925 12.56799 -12.30964 0.25835 -0.73564 -0.24504 -0.98069
magnitude: 1.02507 au
magnitude: 2.60551 debye
