program: Orca
programVersion: 5.0.2
elementType: O O O C C C C C C C C C C C C C C C C C C C H H H H H H H H H H H H H H H H H H H H H H H H H H H H H H H H H H
charge: 0
multiplicity: 1
keywords: wb97x-d3
keywords: def2-TZVPP
keywords: def2/J RIJCOSX
keywords: DEFGRID2
keywords: scfconv7
keywords: smallprint printgap noloewdin
keywords: NOSOSCF
formula: C19H34O3
InChI: InChI=1/C19H34O3/c1-15(2)22-18(20)14-17(4)11-8-10-16(3)12-9-13-19(5,6)21-7/h8,11,14-16H,9-10,12-13H2,1-7H3
56 atoms
O  -0.837026 1.871262 -0.949978
O  3.699591 -0.010629 0.663189
O  3.228023 -0.226298 -1.511806
C  -3.334044 0.348568 -0.637256
C  -3.107228 1.835141 -0.335427
C  -3.917088 -0.459728 0.521239
C  -1.701257 2.248974 0.122468
C  -4.109759 -1.954031 0.225195
C  -2.844575 -2.785935 0.502814
C  -1.293563 1.549351 1.417525
C  -1.689915 3.762615 0.334826
C  -5.265648 -2.523006 1.04135
C  -1.657234 -2.374144 -0.295054
C  0.504886 2.283004 -0.88047
C  -0.498444 -1.961559 0.229941
C  0.639309 -1.461006 -0.535614
C  0.520317 -1.45842 -2.026429
C  1.692004 -0.995594 0.171969
C  2.920608 -0.390521 -0.349977
C  4.973557 0.605749 0.387857
C  5.316007 1.429688 1.610409
C  6.016062 -0.45725 0.099837
H  -2.407218 -0.102345 -0.993367
H  -4.032268 0.268138 -1.475561
H  -3.823499 2.169647 0.421499
H  -3.334888 2.419397 -1.232543
H  -4.888908 -0.021838 0.773464
H  -3.304748 -0.350831 1.421776
H  -4.361076 -2.066909 -0.836983
H  -3.073131 -3.833044 0.27201
H  -2.612035 -2.743026 1.571602
H  -2.021071 1.750063 2.205125
H  -0.326877 1.899096 1.784998
H  -1.227535 0.468418 1.292707
H  -0.73033 4.124997 0.707834
H  -1.918369 4.298056 -0.589423
H  -2.443213 4.043869 1.072187
H  -5.091371 -2.400638 2.113421
H  -5.407612 -3.588924 0.851275
H  -6.203914 -2.019058 0.802431
H  -1.782963 -2.402261 -1.373778
H  1.032173 1.805877 -1.70732
H  1.00635 1.990716 0.047772
H  0.624515 3.365546 -0.998759
H  -0.394223 -1.94345 1.311582
H  -0.269246 -0.768688 -2.333508
H  1.434463 -1.166961 -2.528267
H  0.23356 -2.446548 -2.389459
H  1.634661 -1.045306 1.253715
H  4.871583 1.267907 -0.47518
H  5.426785 0.805839 2.499294
H  6.260791 1.948933 1.448845
H  4.555281 2.185407 1.810911
H  5.768088 -1.052123 -0.779051
H  6.135165 -1.131281 0.950208
H  6.980589 0.016164 -0.088218
elementType: O C H
totalener: -970.28391078 hartree
nucrepener: 1958.57496996 hartree
electener: -2928.85888074 hartree
oneelecener: -5210.21831774 hartree
twoeener: 2281.35943700 hartree
cpcmener: -0.02147849 hartree
kineticenergy: 965.60021984 hartree
xcener: -96.763675523029 hartree
chargesum: 0.0000000
charge: -0.394912 -0.294418 -0.490374 -0.089264 -0.192214 -0.211719 0.380809 0.079426 -0.130626 -0.410751 -0.338236 -0.305987 -0.073302 -0.148029 -0.215542 0.026608 -0.282993 -0.183880 0.465400 0.159420 -0.254479 -0.264974 0.037933 0.081548 0.073211 0.090155 0.076187 0.083226 0.042184 0.092873 0.079300 0.113033 0.108100 0.093833 0.098673 0.100984 0.099788 0.087102 0.088960 0.088372 0.129537 0.112628 0.094243 0.110662 0.118900 0.111083 0.115600 0.113899 0.112303 0.062027 0.088112 0.089343 0.096630 0.094771 0.089059 0.095778
qa: -0.3949 -0.2944 -0.4904 -0.0893 -0.1922 -0.2117 0.3808 0.0794 -0.1306 -0.4108 -0.3382 -0.3060 -0.0733 -0.1480 -0.2155 0.0266 -0.2830 -0.1839 0.4654 0.1594 -0.2545 -0.2650 0.0379 0.0815 0.0732 0.0902 0.0762 0.0832 0.0422 0.0929 0.0793 0.1130 0.1081 0.0938 0.0987 0.1010 0.0998 0.0871 0.0890 0.0884 0.1295 0.1126 0.0942 0.1107 0.1189 0.1111 0.1156 0.1139 0.1123 0.0620 0.0881 0.0893 0.0966 0.0948 0.0891 0.0958
va: 1.9437 2.1209 2.0000 3.8388 3.8444 3.9084 3.7703 3.7572 3.9326 3.9607 3.9166 3.9391 3.8173 3.9355 3.9029 3.6261 3.8968 3.7289 4.1511 3.8176 3.9350 3.9092 1.0482 1.0091 1.0159 1.0182 1.0095 1.0034 1.0224 1.0060 1.0131 1.0057 1.0043 0.9931 0.9991 1.0080 1.0053 1.0000 1.0048 1.0047 0.9988 0.9953 0.9750 0.9901 1.0166 0.9961 1.0357 0.9999 1.0358 1.0233 1.0067 1.0059 1.0072 1.0169 1.0069 1.0060
dispcorr: -0.030543037 hartree
energy: -970.314453821145
dipole: -12.91205 12.24437 -0.66768 5.53618 -5.38551 0.15067 6.63411 -5.37886 1.25525
magnitude: 1.42974 au
magnitude: 3.63412 debye
