program: Orca
programVersion: 5.0.2
elementType: O O O C C C C C C C C C C C C C C C C C C C H H H H H H H H H H H H H H H H H H H H H H H H H H H H H H H H H H
charge: 0
multiplicity: 1
keywords: wb97x-d3
keywords: def2-TZVPP
keywords: def2/J RIJCOSX
keywords: DEFGRID2
keywords: scfconv7
keywords: smallprint printgap noloewdin
keywords: NOSOSCF
formula: C19H34O3
InChI: InChI=1/C19H34O3/c1-15(2)22-18(20)14-17(4)11-8-10-16(3)12-9-13-19(5,6)21-7/h8,11,14-16H,9-10,12-13H2,1-7H3
56 atoms
O  -5.558944 2.59492 -0.050272
O  5.29874 -1.835859 0.483244
O  4.790274 -0.753992 -1.407626
C  -3.26227 1.165298 1.178331
C  -3.299287 1.969422 -0.118043
C  -2.365136 -0.069499 1.086013
C  -4.255265 3.168158 -0.144597
C  -2.850165 -1.17667 0.146594
C  -1.79452 -2.286385 0.018596
C  -4.078854 3.902225 -1.473964
C  -3.976094 4.127962 1.011315
C  -4.176153 -1.771289 0.605191
C  -0.532529 -1.815449 -0.619216
C  -6.652649 3.474415 0.010805
C  0.688361 -1.944594 -0.089579
C  1.928198 -1.478646 -0.706491
C  1.822826 -0.757073 -2.012823
C  3.073181 -1.73864 -0.039048
C  4.439854 -1.373563 -0.426319
C  6.708312 -1.578054 0.327373
C  7.044072 -0.193184 0.846946
C  7.423524 -2.670208 1.093381
H  -4.272582 0.877073 1.478835
H  -2.8797 1.795246 1.985899
H  -3.568529 1.317534 -0.95581
H  -2.289954 2.333399 -0.335436
H  -2.244052 -0.499154 2.087161
H  -1.364403 0.254386 0.779562
H  -2.996299 -0.755545 -0.854934
H  -2.215158 -3.087316 -0.600967
H  -1.588445 -2.725154 1.000219
H  -4.268596 3.239357 -2.320896
H  -3.057519 4.274364 -1.567736
H  -4.739755 4.765743 -1.566676
H  -4.208337 3.684781 1.981017
H  -2.92144 4.407969 1.020543
H  -4.54767 5.053944 0.924484
H  -4.974465 -1.027839 0.621888
H  -4.094942 -2.188817 1.612322
H  -4.500974 -2.574208 -0.059769
H  -0.653711 -1.332985 -1.585811
H  -6.741971 4.11859 -0.870963
H  -6.643058 4.117171 0.897588
H  -7.553666 2.861118 0.060482
H  0.788967 -2.430687 0.877259
H  1.375694 -1.407053 -2.767884
H  1.164004 0.10791 -1.914575
H  2.77855 -0.414016 -2.389271
H  2.998418 -2.277881 0.898888
H  6.970831 -1.649738 -0.730941
H  6.786895 -0.09631 1.90359
H  8.115019 -0.012399 0.745998
H  6.526839 0.590883 0.293474
H  7.178941 -2.64186 2.15703
H  8.50169 -2.541427 0.996395
H  7.173569 -3.659553 0.707685
elementType: O C H
totalener: -970.28777997 hartree
nucrepener: 1769.39013560 hartree
electener: -2739.67791556 hartree
oneelecener: -4831.48143543 hartree
twoeener: 2091.80351987 hartree
cpcmener: -0.02217975 hartree
kineticenergy: 965.58799480 hartree
xcener: -96.758223189262 hartree
chargesum: -0.0000000
charge: -0.393755 -0.292572 -0.489251 -0.149029 -0.143073 -0.195350 0.318225 0.073049 -0.125317 -0.332904 -0.376112 -0.317047 -0.136759 -0.121361 -0.144843 0.016989 -0.265272 -0.181221 0.470565 0.156846 -0.263382 -0.252309 0.072971 0.083607 0.081332 0.076812 0.084511 0.079864 0.045238 0.095731 0.079883 0.099001 0.096135 0.098044 0.103805 0.103256 0.103613 0.090961 0.086147 0.091961 0.122226 0.087454 0.090305 0.115616 0.111190 0.105705 0.103675 0.109005 0.113213 0.061730 0.088787 0.095089 0.094381 0.087773 0.088644 0.096215
qa: -0.3938 -0.2926 -0.4893 -0.1490 -0.1431 -0.1953 0.3182 0.0730 -0.1253 -0.3329 -0.3761 -0.3170 -0.1368 -0.1214 -0.1448 0.0170 -0.2653 -0.1812 0.4706 0.1568 -0.2634 -0.2523 0.0730 0.0836 0.0813 0.0768 0.0845 0.0799 0.0452 0.0957 0.0799 0.0990 0.0961 0.0980 0.1038 0.1033 0.1036 0.0910 0.0861 0.0920 0.1222 0.0875 0.0903 0.1156 0.1112 0.1057 0.1037 0.1090 0.1132 0.0617 0.0888 0.0951 0.0944 0.0878 0.0886 0.0962
va: 1.9551 2.1269 2.0117 3.8726 3.7386 3.9203 3.8546 3.7545 3.9106 3.9236 3.9440 3.9487 3.8791 3.9332 3.9089 3.7018 3.9182 3.7820 4.1732 3.8210 3.9062 3.9318 1.0237 1.0090 1.0318 1.0161 1.0110 1.0086 1.0240 1.0049 1.0161 1.0082 1.0054 1.0032 0.9973 1.0031 0.9985 1.0063 1.0016 1.0046 1.0056 0.9829 0.9813 0.9922 1.0236 0.9956 0.9967 1.0370 1.0341 1.0238 1.0070 1.0060 1.0169 1.0070 1.0058 1.0084
dispcorr: -0.023950294 hartree
energy: -970.311730260882
dipole: -20.63491 19.98086 -0.65405 11.69615 -11.35523 0.34092 4.49405 -3.90895 0.58510
magnitude: 0.94147 au
magnitude: 2.39301 debye
