program: Orca
programVersion: 5.0.2
elementType: O O O C C C C C C C C C C C C C C C C C C C H H H H H H H H H H H H H H H H H H H H H H H H H H H H H H H H H H
charge: 0
multiplicity: 1
keywords: wb97x-d3
keywords: def2-TZVPP
keywords: def2/J RIJCOSX
keywords: DEFGRID2
keywords: scfconv7
keywords: smallprint printgap noloewdin
keywords: NOSOSCF
formula: C19H34O3
InChI: InChI=1/C19H34O3/c1-15(2)22-18(20)14-17(4)11-8-10-16(3)12-9-13-19(5,6)21-7/h8,11,14-16H,9-10,12-13H2,1-7H3
56 atoms
O  -5.099099 2.604298 -0.575219
O  5.136806 -1.721688 0.525076
O  4.568725 -0.393978 -1.182368
C  -3.414741 0.945389 1.219015
C  -2.974668 1.850611 0.07144
C  -2.62028 -0.360707 1.253046
C  -3.823878 3.102418 -0.173017
C  -3.03009 -1.382426 0.187945
C  -1.931205 -2.43332 -0.032948
C  -3.182237 3.915841 -1.296851
C  -3.922923 3.955979 1.090456
C  -4.343504 -2.065805 0.548734
C  -0.688412 -1.845273 -0.608025
C  -6.121408 3.540484 -0.79953
C  0.53386 -1.967658 -0.080091
C  1.751468 -1.373569 -0.627629
C  1.613807 -0.517717 -1.846339
C  2.9049 -1.648601 0.019236
C  4.252691 -1.17127 -0.307351
C  6.534908 -1.391688 0.395685
C  6.829577 -0.082615 1.101549
C  7.299401 -2.554506 0.992043
H  -4.48477 0.731806 1.152653
H  -3.270632 1.466255 2.169164
H  -2.947578 1.279399 -0.862872
H  -1.944276 2.170779 0.254566
H  -2.721565 -0.829622 2.237941
H  -1.55717 -0.118977 1.14829
H  -3.173046 -0.86083 -0.76609
H  -2.313284 -3.189023 -0.729392
H  -1.712498 -2.952825 0.905293
H  -3.106416 3.328988 -2.214951
H  -2.173435 4.221018 -1.01489
H  -3.737409 4.827757 -1.52412
H  -4.480534 3.454477 1.883218
H  -2.924881 4.173235 1.474748
H  -4.405754 4.916471 0.900803
H  -5.144253 -1.344391 0.719215
H  -4.238841 -2.661906 1.45884
H  -4.67646 -2.734268 -0.247688
H  -0.826061 -1.273627 -1.52203
H  -6.994987 2.983962 -1.142293
H  -5.875604 4.275507 -1.573358
H  -6.413256 4.087191 0.103487
H  0.652429 -2.546758 0.831778
H  2.552535 -0.093906 -2.179389
H  1.193426 -1.09929 -2.669278
H  0.918741 0.302168 -1.655628
H  2.852965 -2.300281 0.884109
H  6.784215 -1.304108 -0.664711
H  6.584501 -0.144251 2.163326
H  7.892154 0.148404 1.016535
H  6.278504 0.751988 0.668325
H  7.073822 -2.684083 2.052047
H  8.37059 -2.375063 0.898456
H  7.075511 -3.488152 0.474312
elementType: O C H
totalener: -970.28726504 hartree
nucrepener: 1785.20345133 hartree
electener: -2755.49071637 hartree
oneelecener: -4863.12207231 hartree
twoeener: 2107.63135594 hartree
cpcmener: -0.02211016 hartree
kineticenergy: 965.60124520 hartree
xcener: -96.760196847935 hartree
chargesum: 0.0000000
charge: -0.393561 -0.293357 -0.489441 -0.140814 -0.155185 -0.178537 0.319496 0.044548 -0.109083 -0.330319 -0.374544 -0.310831 -0.131257 -0.122327 -0.152449 0.021388 -0.263027 -0.182551 0.470990 0.157965 -0.263728 -0.251927 0.067401 0.079127 0.080633 0.075301 0.086815 0.080532 0.049655 0.093727 0.078921 0.098351 0.095541 0.097788 0.103231 0.103095 0.104055 0.092395 0.081832 0.091672 0.119415 0.116549 0.088181 0.090513 0.111465 0.108605 0.105531 0.102770 0.113132 0.061488 0.088789 0.095488 0.094067 0.087719 0.088823 0.095940
qa: -0.3936 -0.2934 -0.4894 -0.1408 -0.1552 -0.1785 0.3195 0.0445 -0.1091 -0.3303 -0.3745 -0.3108 -0.1313 -0.1223 -0.1524 0.0214 -0.2630 -0.1826 0.4710 0.1580 -0.2637 -0.2519 0.0674 0.0791 0.0806 0.0753 0.0868 0.0805 0.0497 0.0937 0.0789 0.0984 0.0955 0.0978 0.1032 0.1031 0.1041 0.0924 0.0818 0.0917 0.1194 0.1165 0.0882 0.0905 0.1115 0.1086 0.1055 0.1028 0.1131 0.0615 0.0888 0.0955 0.0941 0.0877 0.0888 0.0959
va: 1.9556 2.1269 2.0113 3.8748 3.7587 3.9113 3.8582 3.7714 3.8963 3.9217 3.9409 3.9484 3.8795 3.9319 3.9047 3.7001 3.9184 3.7850 4.1714 3.8193 3.9062 3.9323 1.0329 1.0078 1.0254 1.0174 1.0096 1.0077 1.0218 1.0044 1.0157 1.0089 1.0058 1.0032 0.9974 1.0032 0.9987 1.0042 1.0030 1.0038 1.0078 0.9921 0.9830 0.9816 1.0234 1.0373 0.9955 0.9975 1.0340 1.0238 1.0070 1.0059 1.0173 1.0071 1.0057 1.0085
dispcorr: -0.024122847 hartree
energy: -970.311387886355
dipole: -19.59495 18.99066 -0.60429 10.31496 -10.14043 0.17453 4.50605 -3.88652 0.61953
magnitude: 0.88286 au
magnitude: 2.24406 debye
