program: Orca
programVersion: 5.0.2
elementType: O O O C C C C C C C C C C C C C C C C C C C H H H H H H H H H H H H H H H H H H H H H H H H H H H H H H H H H H
charge: 0
multiplicity: 1
keywords: wb97x-d3
keywords: def2-TZVPP
keywords: def2/J RIJCOSX
keywords: DEFGRID2
keywords: scfconv7
keywords: smallprint printgap noloewdin
keywords: NOSOSCF
formula: C19H34O3
InChI: InChI=1/C19H34O3/c1-15(2)22-18(20)14-17(4)11-8-10-16(3)12-9-13-19(5,6)21-7/h8,11,14-16H,9-10,12-13H2,1-7H3
56 atoms
O  -5.181377 2.550812 -0.649825
O  5.144432 -1.503551 0.735001
O  4.619305 -0.362929 -1.115803
C  -3.44515 0.986427 1.183145
C  -3.035194 1.874703 0.011403
C  -2.617062 -0.297841 1.245827
C  -3.920838 3.095138 -0.261333
C  -2.998633 -1.355142 0.205448
C  -1.883727 -2.398625 0.032871
C  -3.303592 3.900762 -1.404208
C  -4.044914 3.974204 0.982012
C  -4.307039 -2.047132 0.568581
C  -0.640511 -1.819969 -0.550531
C  -6.228672 3.45088 -0.90421
C  0.572448 -1.893742 0.007039
C  1.794646 -1.318088 -0.549799
C  1.676668 -0.548711 -1.826883
C  2.93325 -1.526085 0.146219
C  4.283478 -1.055046 -0.178736
C  6.545095 -1.186078 0.607491
C  7.124188 -1.259337 2.004365
C  7.210535 -2.157104 -0.348668
H  -4.509592 0.744033 1.128795
H  -3.309232 1.534076 2.119366
H  -2.994535 1.281684 -0.908662
H  -2.013927 2.228796 0.1827
H  -2.706916 -0.746457 2.24129
H  -1.56043 -0.031528 1.135184
H  -3.135071 -0.863906 -0.765369
H  -2.249551 -3.18379 -0.639149
H  -1.669429 -2.880793 0.991883
H  -3.209541 3.295129 -2.308364
H  -2.304658 4.242894 -1.129723
H  -3.885896 4.789934 -1.652699
H  -4.58829 3.474933 1.785978
H  -3.053836 4.228898 1.361191
H  -4.55519 4.915784 0.770616
H  -5.121958 -1.334288 0.703558
H  -4.20683 -2.612209 1.49878
H  -4.61665 -2.746293 -0.210726
H  -0.768734 -1.302028 -1.497275
H  -7.087997 2.859255 -1.223487
H  -6.004519 4.163264 -1.705325
H  -6.532776 4.022293 -0.020749
H  0.679132 -2.417312 0.953323
H  0.97847 0.281352 -1.703177
H  2.620528 -0.147058 -2.172668
H  1.269264 -1.185428 -2.614544
H  2.865807 -2.111014 1.056502
H  6.647273 -0.166194 0.228957
H  7.036735 -2.262669 2.425105
H  8.182759 -1.00036 1.97609
H  6.631485 -0.557678 2.678625
H  7.112156 -3.185583 0.003406
H  8.274709 -1.929589 -0.422038
H  6.793536 -2.095086 -1.353837
elementType: O C H
totalener: -970.28741825 hartree
nucrepener: 1782.13516936 hartree
electener: -2752.42258761 hartree
oneelecener: -4856.98699245 hartree
twoeener: 2104.56440484 hartree
cpcmener: -0.02214030 hartree
kineticenergy: 965.60161658 hartree
xcener: -96.760236499666 hartree
chargesum: -0.0000000
charge: -0.393420 -0.292579 -0.489405 -0.140742 -0.155335 -0.181190 0.320611 0.048636 -0.111512 -0.330956 -0.374271 -0.311414 -0.130128 -0.122185 -0.152688 0.019737 -0.263036 -0.181394 0.470692 0.155567 -0.251834 -0.263117 0.067634 0.079071 0.080683 0.075620 0.086640 0.080754 0.049342 0.093864 0.079136 0.098527 0.095646 0.097793 0.103178 0.102716 0.103862 0.092481 0.082007 0.091619 0.119675 0.116410 0.088079 0.090338 0.111277 0.103882 0.108269 0.104787 0.112854 0.062108 0.087765 0.089128 0.096362 0.089237 0.094655 0.094564
qa: -0.3934 -0.2926 -0.4894 -0.1407 -0.1553 -0.1812 0.3206 0.0486 -0.1115 -0.3310 -0.3743 -0.3114 -0.1301 -0.1222 -0.1527 0.0197 -0.2630 -0.1814 0.4707 0.1556 -0.2518 -0.2631 0.0676 0.0791 0.0807 0.0756 0.0866 0.0808 0.0493 0.0939 0.0791 0.0985 0.0956 0.0978 0.1032 0.1027 0.1039 0.0925 0.0820 0.0916 0.1197 0.1164 0.0881 0.0903 0.1113 0.1039 0.1083 0.1048 0.1129 0.0621 0.0878 0.0891 0.0964 0.0892 0.0947 0.0946
va: 1.9560 2.1271 2.0116 3.8739 3.7585 3.9142 3.8568 3.7680 3.8988 3.9219 3.9413 3.9480 3.8776 3.9322 3.9053 3.6991 3.9189 3.7815 4.1742 3.8207 3.9323 3.9077 1.0324 1.0077 1.0256 1.0171 1.0098 1.0076 1.0222 1.0044 1.0159 1.0087 1.0058 1.0031 0.9975 1.0033 0.9988 1.0043 1.0029 1.0038 1.0076 0.9920 0.9830 0.9816 1.0236 0.9971 1.0373 0.9958 1.0341 1.0242 1.0069 1.0057 1.0084 1.0069 1.0063 1.0167
dispcorr: -0.024069565 hartree
energy: -970.311487815438
dipole: -19.69841 19.06830 -0.63011 8.60025 -8.40361 0.19664 2.91378 -2.29932 0.61445
magnitude: 0.90181 au
magnitude: 2.29222 debye
