program: Orca
programVersion: 5.0.2
elementType: O O O C C C C C C C C C C C C C C C C C C C H H H H H H H H H H H H H H H H H H H H H H H H H H H H H H H H H H
charge: 0
multiplicity: 1
keywords: wb97x-d3
keywords: def2-TZVPP
keywords: def2/J RIJCOSX
keywords: DEFGRID2
keywords: scfconv7
keywords: smallprint printgap noloewdin
keywords: NOSOSCF
formula: C19H34O3
InChI: InChI=1/C19H34O3/c1-15(2)22-18(20)14-17(4)11-8-10-16(3)12-9-13-19(5,6)21-7/h8,11,14-16H,9-10,12-13H2,1-7H3
56 atoms
O  -5.709412 2.529519 0.219846
O  5.348285 -1.565885 0.628141
O  4.872014 -0.925108 -1.460555
C  -3.135367 1.356544 1.080863
C  -3.478347 1.996328 -0.260242
C  -2.201142 0.154808 0.949656
C  -4.497443 3.140696 -0.219794
C  -2.750086 -1.036046 0.159293
C  -1.729371 -2.184833 0.138927
C  -4.652978 3.703394 -1.632587
C  -4.049631 4.251607 0.728866
C  -4.080652 -1.529379 0.712876
C  -0.462372 -1.825874 -0.559039
C  -6.827158 3.358765 0.407675
C  0.754855 -1.881904 -0.008491
C  2.001962 -1.524352 -0.680191
C  1.914977 -1.062332 -2.10033
C  3.135811 -1.637377 0.044874
C  4.506362 -1.333667 -0.379531
C  6.759358 -1.333653 0.44251
C  7.332571 -1.108147 1.825264
C  7.399453 -2.51622 -0.259264
H  -4.045853 1.063937 1.609354
H  -2.643238 2.092146 1.722985
H  -3.866291 1.236826 -0.947273
H  -2.559139 2.372896 -0.720163
H  -1.935048 -0.193685 1.954518
H  -1.263209 0.486989 0.492072
H  -2.910911 -0.729852 -0.88095
H  -2.181428 -3.035318 -0.384829
H  -1.522301 -2.518634 1.160703
H  -4.976857 2.930432 -2.332925
H  -3.700266 4.096343 -1.990616
H  -5.371193 4.5238 -1.680484
H  -4.036356 3.925661 1.770152
H  -3.040701 4.579736 0.473528
H  -4.693146 5.131014 0.665271
H  -4.862993 -0.772792 0.633482
H  -3.995421 -1.804149 1.767796
H  -4.430034 -2.410331 0.170421
H  -0.576406 -1.493829 -1.587818
H  -7.655433 2.715652 0.709684
H  -7.135754 3.885521 -0.501862
H  -6.685623 4.104456 1.197388
H  0.845357 -2.211065 1.023355
H  1.28136 -0.175579 -2.170717
H  2.879157 -0.822238 -2.53122
H  1.448405 -1.83033 -2.720407
H  3.046638 -1.988204 1.067163
H  6.896269 -0.430202 -0.156906
H  7.200949 -1.984251 2.462913
H  8.401646 -0.907882 1.751533
H  6.869573 -0.251065 2.316371
H  7.279603 -3.431778 0.323115
H  8.468315 -2.335131 -0.380329
H  6.98294 -2.683498 -1.252662
elementType: O C H
totalener: -970.28789629 hartree
nucrepener: 1765.62441995 hartree
electener: -2735.91231624 hartree
oneelecener: -4823.97193649 hartree
twoeener: 2088.05962025 hartree
cpcmener: -0.02212545 hartree
kineticenergy: 965.59537213 hartree
xcener: -96.759965597241 hartree
chargesum: 0.0000000
charge: -0.390998 -0.293056 -0.489364 -0.141372 -0.151452 -0.209312 0.313543 0.093797 -0.133138 -0.329217 -0.374425 -0.320684 -0.132015 -0.122316 -0.146140 0.015391 -0.266151 -0.180259 0.470644 0.158009 -0.252720 -0.264413 0.073922 0.084902 0.082695 0.081611 0.081491 0.080180 0.045572 0.094571 0.079852 0.098554 0.095647 0.097683 0.102919 0.103393 0.103719 0.084148 0.089027 0.091942 0.123331 0.115035 0.087809 0.090943 0.111470 0.104148 0.109269 0.105051 0.113451 0.061824 0.087737 0.089026 0.096104 0.088550 0.095451 0.094622
qa: -0.3910 -0.2931 -0.4894 -0.1414 -0.1515 -0.2093 0.3135 0.0938 -0.1331 -0.3292 -0.3744 -0.3207 -0.1320 -0.1223 -0.1461 0.0154 -0.2662 -0.1803 0.4706 0.1580 -0.2527 -0.2644 0.0739 0.0849 0.0827 0.0816 0.0815 0.0802 0.0456 0.0946 0.0799 0.0986 0.0956 0.0977 0.1029 0.1034 0.1037 0.0841 0.0890 0.0919 0.1233 0.1150 0.0878 0.0909 0.1115 0.1041 0.1093 0.1051 0.1135 0.0618 0.0877 0.0890 0.0961 0.0886 0.0955 0.0946
va: 1.9543 2.1271 2.0111 3.8711 3.7298 3.9275 3.8637 3.7290 3.9166 3.9218 3.9438 3.9511 3.8750 3.9331 3.9144 3.7019 3.9187 3.7814 4.1722 3.8198 3.9326 3.9047 1.0226 1.0088 1.0285 1.0166 1.0105 1.0077 1.0226 1.0059 1.0159 1.0082 1.0057 1.0031 0.9978 1.0030 0.9987 1.0124 1.0004 1.0058 1.0045 0.9920 0.9828 0.9816 1.0236 0.9960 1.0370 0.9961 1.0338 1.0235 1.0073 1.0056 1.0083 1.0069 1.0059 1.0177
dispcorr: -0.024064604 hartree
energy: -970.311960891602
dipole: -21.10731 20.38815 -0.71916 10.47960 -10.02060 0.45900 3.04631 -2.54097 0.50534
magnitude: 0.99158 au
magnitude: 2.52040 debye
