program: Orca
programVersion: 5.0.2
elementType: O O O C C C C C C C C C C C C C C C C C C C H H H H H H H H H H H H H H H H H H H H H H H H H H H H H H H H H H
charge: 0
multiplicity: 1
keywords: wb97x-d3
keywords: def2-TZVPP
keywords: def2/J RIJCOSX
keywords: DEFGRID2
keywords: scfconv7
keywords: smallprint printgap noloewdin
keywords: NOSOSCF
formula: C19H34O3
InChI: InChI=1/C19H34O3/c1-15(2)22-18(20)14-17(4)11-8-10-16(3)12-9-13-19(5,6)21-7/h8,11,14-16H,9-10,12-13H2,1-7H3
56 atoms
O  -6.270891 3.065666 0.584668
O  5.568765 -2.127227 0.472298
O  5.09405 -1.503034 -1.62232
C  -4.12706 1.042473 1.106689
C  -4.376348 1.737529 -0.227244
C  -3.72801 -0.424273 0.95842
C  -5.042162 3.120306 -0.139041
C  -2.476689 -0.709912 0.124925
C  -1.235675 -0.025452 0.715275
C  -5.251247 3.670236 -1.549615
C  -4.175993 4.091714 0.654746
C  -2.265423 -2.213907 -0.000966
C  -0.019575 -0.211726 -0.125402
C  -7.315618 2.308047 0.029891
C  1.136028 -0.729343 0.304306
C  2.335251 -0.906744 -0.5118
C  2.250654 -0.519957 -1.954042
C  3.425765 -1.407754 0.108296
C  4.747542 -1.667759 -0.471985
C  6.945614 -2.403072 0.14411
C  7.753122 -1.119334 0.170357
C  7.430854 -3.408535 1.166509
H  -5.032678 1.081056 1.718324
H  -3.365175 1.581621 1.676601
H  -4.97971 1.082914 -0.866354
H  -3.431075 1.867564 -0.762901
H  -4.566875 -0.968571 0.510979
H  -3.590133 -0.85629 1.956114
H  -2.630671 -0.308288 -0.883696
H  -1.05787 -0.391656 1.731615
H  -1.426586 1.050439 0.797537
H  -4.28794 3.847079 -2.030325
H  -5.787608 4.621397 -1.528942
H  -5.806103 2.982114 -2.190335
H  -4.605398 5.095728 0.646558
H  -4.069572 3.786379 1.696839
H  -3.176261 4.156002 0.223451
H  -2.070961 -2.668205 0.974121
H  -1.421849 -2.457009 -0.649168
H  -3.147865 -2.70083 -0.420499
H  -0.115568 0.11053 -1.158865
H  -7.708707 2.732505 -0.900401
H  -8.128607 2.303735 0.757557
H  -7.044267 1.264799 -0.1645
H  1.211956 -1.04655 1.340928
H  3.170018 -0.695249 -2.498156
H  1.451862 -1.077664 -2.446732
H  1.99763 0.538004 -2.04734
H  3.341238 -1.642287 1.163489
H  6.993185 -2.850054 -0.851829
H  8.797184 -1.33791 -0.057368
H  7.403179 -0.396404 -0.566446
H  7.716944 -0.652336 1.156248
H  7.3964 -3.001975 2.178856
H  8.464794 -3.67903 0.95133
H  6.838536 -4.324032 1.141007
elementType: O C H
totalener: -970.28851059 hartree
nucrepener: 1753.89227550 hartree
electener: -2724.18078609 hartree
oneelecener: -4799.96202930 hartree
twoeener: 2075.78124321 hartree
cpcmener: -0.02315118 hartree
kineticenergy: 965.59558951 hartree
xcener: -96.760155286667 hartree
chargesum: 0.0000000
charge: -0.408636 -0.292797 -0.490034 -0.133939 -0.274937 -0.217189 0.385489 0.102749 -0.137874 -0.335214 -0.315873 -0.324552 -0.158146 -0.129097 -0.129703 0.011459 -0.264986 -0.182130 0.469884 0.158027 -0.263421 -0.252119 0.087263 0.079396 0.092473 0.088657 0.077181 0.082662 0.049514 0.085176 0.101074 0.097853 0.102942 0.097700 0.099423 0.096210 0.088871 0.085586 0.095258 0.093680 0.126123 0.092453 0.121852 0.088000 0.110973 0.109116 0.103705 0.104055 0.113197 0.061590 0.094945 0.094199 0.089022 0.087739 0.089041 0.096113
qa: -0.4086 -0.2928 -0.4900 -0.1339 -0.2749 -0.2172 0.3855 0.1027 -0.1379 -0.3352 -0.3159 -0.3246 -0.1581 -0.1291 -0.1297 0.0115 -0.2650 -0.1821 0.4699 0.1580 -0.2634 -0.2521 0.0873 0.0794 0.0925 0.0887 0.0772 0.0827 0.0495 0.0852 0.1011 0.0979 0.1029 0.0977 0.0994 0.0962 0.0889 0.0856 0.0953 0.0937 0.1261 0.0925 0.1219 0.0880 0.1110 0.1091 0.1037 0.1041 0.1132 0.0616 0.0949 0.0942 0.0890 0.0877 0.0890 0.0961
va: 1.9362 2.1278 2.0105 3.8377 3.8394 3.9269 3.8042 3.7036 3.9105 3.9138 3.9090 3.9441 3.8857 3.9303 3.9144 3.7118 3.9204 3.7823 4.1740 3.8201 3.9069 3.9321 1.0226 1.0026 1.0006 1.0096 1.0088 1.0084 1.0199 1.0171 1.0014 1.0061 1.0075 0.9982 1.0097 1.0065 1.0058 1.0039 1.0015 1.0049 1.0044 0.9847 0.9904 0.9816 1.0245 1.0375 0.9965 0.9959 1.0340 1.0239 1.0060 1.0171 1.0069 1.0069 1.0056 1.0085
dispcorr: -0.024341686 hartree
energy: -970.312852278432
dipole: -21.15122 20.47859 -0.67263 6.52695 -6.69742 -0.17048 0.79888 -0.67205 0.12683
magnitude: 0.70540 au
magnitude: 1.79298 debye
