program: Orca
programVersion: 5.0.2
elementType: O O O C C C C C C C C C C C C C C C C C C C H H H H H H H H H H H H H H H H H H H H H H H H H H H H H H H H H H
charge: 0
multiplicity: 1
keywords: wb97x-d3
keywords: def2-TZVPP
keywords: def2/J RIJCOSX
keywords: DEFGRID2
keywords: scfconv7
keywords: smallprint printgap noloewdin
keywords: NOSOSCF
formula: C19H34O3
InChI: InChI=1/C19H34O3/c1-15(2)22-18(20)14-17(4)11-8-10-16(3)12-9-13-19(5,6)21-7/h8,11,14-16H,9-10,12-13H2,1-7H3
56 atoms
O  -0.616982 1.653973 -0.882541
O  3.46789 -0.280535 0.606042
O  2.948817 0.058337 -1.543994
C  -2.919039 0.366312 0.281572
C  -1.793726 1.036798 1.061841
C  -3.560303 -0.777136 1.078255
C  -1.05565 2.187139 0.365403
C  -4.119753 -1.925292 0.2262
C  -3.035338 -2.977425 -0.086229
C  0.132062 2.601089 1.234281
C  -1.984768 3.381737 0.152683
C  -5.28898 -2.611144 0.923498
C  -1.854258 -2.430995 -0.811344
C  0.230577 2.452783 -1.667524
C  -0.654748 -2.235175 -0.253596
C  0.470815 -1.566429 -0.900431
C  0.371034 -1.310053 -2.369874
C  1.498476 -1.206244 -0.101287
C  2.68312 -0.423012 -0.462599
C  4.679312 0.49551 0.503114
C  4.367911 1.969257 0.680172
C  5.612939 -0.030016 1.573028
H  -2.52991 -0.010492 -0.664643
H  -3.693369 1.092146 0.016544
H  -1.056862 0.269951 1.327374
H  -2.184566 1.416128 2.011482
H  -4.360098 -0.364894 1.700769
H  -2.832731 -1.194076 1.784807
H  -4.485564 -1.513613 -0.722159
H  -3.488071 -3.771067 -0.689698
H  -2.715716 -3.4345 0.855611
H  -0.205651 2.847108 2.242219
H  0.646706 3.482098 0.846336
H  0.862509 1.791903 1.317298
H  -2.411265 3.702232 1.104647
H  -1.460858 4.242817 -0.2663
H  -2.812601 3.140254 -0.51627
H  -6.112709 -1.915017 1.09133
H  -4.991034 -3.008432 1.897207
H  -5.677686 -3.444112 0.334033
H  -2.02443 -2.139996 -1.843937
H  1.215777 2.611888 -1.216922
H  -0.194922 3.435503 -1.898843
H  0.380888 1.931887 -2.614118
H  -0.512251 -2.516929 0.786225
H  -0.466298 -0.644565 -2.587157
H  1.268008 -0.871846 -2.789297
H  0.169689 -2.245382 -2.895536
H  1.44031 -1.481067 0.946082
H  5.128752 0.328875 -0.478673
H  3.687959 2.341729 -0.086726
H  3.925962 2.165091 1.658923
H  5.288921 2.549215 0.608697
H  5.821107 -1.091978 1.436454
H  5.202783 0.116201 2.573958
H  6.563631 0.501137 1.522123
elementType: O C H
totalener: -970.28403838 hartree
nucrepener: 1986.25452211 hartree
electener: -2956.53856049 hartree
oneelecener: -5266.09732218 hartree
twoeener: 2309.55876169 hartree
cpcmener: -0.02208661 hartree
kineticenergy: 965.59220634 hartree
xcener: -96.760382958868 hartree
chargesum: -0.0000000
charge: -0.383651 -0.291017 -0.489361 -0.151015 -0.173431 -0.207737 0.324731 0.083051 -0.131424 -0.351036 -0.354649 -0.310314 -0.083545 -0.134107 -0.192113 0.030718 -0.288799 -0.205910 0.473158 0.161154 -0.276041 -0.254247 0.075768 0.093704 0.077288 0.100089 0.086078 0.069930 0.049609 0.090096 0.080573 0.107136 0.103373 0.090621 0.098469 0.100304 0.099888 0.088694 0.086850 0.089085 0.129993 0.083858 0.108833 0.109294 0.115480 0.096773 0.112986 0.122143 0.113330 0.062038 0.094002 0.089826 0.105888 0.096015 0.087936 0.089634
qa: -0.3837 -0.2910 -0.4894 -0.1510 -0.1734 -0.2077 0.3247 0.0831 -0.1314 -0.3510 -0.3546 -0.3103 -0.0835 -0.1341 -0.1921 0.0307 -0.2888 -0.2059 0.4732 0.1612 -0.2760 -0.2542 0.0758 0.0937 0.0773 0.1001 0.0861 0.0699 0.0496 0.0901 0.0806 0.1071 0.1034 0.0906 0.0985 0.1003 0.0999 0.0887 0.0869 0.0891 0.1300 0.0839 0.1088 0.1093 0.1155 0.0968 0.1130 0.1221 0.1133 0.0620 0.0940 0.0898 0.1059 0.0960 0.0879 0.0896
va: 1.9445 2.1184 1.9976 3.8355 3.7836 3.8975 3.8362 3.7474 3.9290 3.9331 3.9491 3.9465 3.8208 3.9324 3.9012 3.6104 3.9040 3.7633 4.1324 3.8201 3.9026 3.9362 1.0217 1.0075 1.0105 1.0163 1.0056 1.0095 1.0207 1.0086 1.0122 1.0082 0.9972 1.0044 1.0044 1.0027 1.0035 1.0043 0.9997 1.0048 0.9986 0.9756 0.9920 0.9889 1.0205 0.9990 1.0325 1.0009 1.0362 1.0245 1.0106 1.0058 1.0085 1.0085 1.0067 1.0056
dispcorr: -0.031271265 hartree
energy: -970.315309647687
dipole: -12.29976 11.62377 -0.67600 8.31574 -7.99432 0.32142 6.87365 -5.93374 0.93991
magnitude: 1.20155 au
magnitude: 3.05409 debye
