program: Orca
programVersion: 5.0.2
elementType: O O O C C C C C C C C C C C C C C C C C C C H H H H H H H H H H H H H H H H H H H H H H H H H H H H H H H H H H
charge: 0
multiplicity: 1
keywords: wb97x-d3
keywords: def2-TZVPP
keywords: def2/J RIJCOSX
keywords: DEFGRID2
keywords: scfconv7
keywords: smallprint printgap noloewdin
keywords: NOSOSCF
formula: C19H34O3
InChI: InChI=1/C19H34O3/c1-15(2)22-18(20)14-17(4)11-8-10-16(3)12-9-13-19(5,6)21-7/h8,11,14-16H,9-10,12-13H2,1-7H3
56 atoms
O  -2.884445 3.484321 -0.895929
O  4.615309 -1.249681 0.693364
O  4.280518 -1.372077 -1.51498
C  -3.443254 0.818871 0.232431
C  -2.830711 2.025205 0.938132
C  -2.736719 -0.473703 0.627061
C  -3.306532 3.403099 0.464357
C  -3.246602 -1.724729 -0.089419
C  -2.26361 -2.897449 0.091441
C  -2.621762 4.476083 1.310428
C  -4.82319 3.535896 0.592789
C  -4.636033 -2.131686 0.384758
C  -0.98224 -2.666974 -0.633369
C  -3.211305 4.646851 -1.613422
C  0.200825 -2.468372 -0.043246
C  1.44673 -2.147439 -0.735013
C  1.415601 -2.093132 -2.229479
C  2.520945 -1.893865 0.042897
C  3.864911 -1.489931 -0.382353
C  5.979232 -0.814064 0.527885
C  6.023129 0.681204 0.275689
C  6.700938 -1.204911 1.79977
H  -3.371912 0.939952 -0.852422
H  -4.509238 0.751883 0.466263
H  -1.740546 1.988905 0.826553
H  -3.023757 1.948539 2.012472
H  -2.815919 -0.626509 1.710601
H  -1.669034 -0.351026 0.420178
H  -3.304019 -1.50356 -1.162975
H  -2.731772 -3.809008 -0.296358
H  -2.080593 -3.063031 1.158191
H  -2.87597 4.347051 2.363891
H  -2.927023 5.486615 1.032621
H  -1.534432 4.41534 1.222621
H  -5.35323 2.857646 -0.078202
H  -5.135261 3.303092 1.612381
H  -5.168549 4.54976 0.38084
H  -5.362785 -1.327228 0.262188
H  -4.625011 -2.406719 1.44275
H  -5.009493 -2.991672 -0.17487
H  -1.062488 -2.621614 -1.716278
H  -4.290139 4.81877 -1.693039
H  -2.825316 4.51621 -2.625948
H  -2.754481 5.553918 -1.202445
H  0.254345 -2.510616 1.041565
H  1.062456 -3.042808 -2.636165
H  0.711912 -1.328108 -2.564523
H  2.3816 -1.876738 -2.669042
H  2.391104 -1.962979 1.117388
H  6.423891 -1.344554 -0.317864
H  5.494709 0.962496 -0.635487
H  5.589047 1.234669 1.110752
H  7.059319 1.003635 0.164463
H  6.658831 -2.281826 1.969315
H  6.278722 -0.701442 2.671999
H  7.751614 -0.922508 1.728942
elementType: O C H
totalener: -970.28828933 hartree
nucrepener: 1786.38538853 hartree
electener: -2756.67367786 hartree
oneelecener: -4865.67126853 hartree
twoeener: 2108.99759067 hartree
cpcmener: -0.02235139 hartree
kineticenergy: 965.59345842 hartree
xcener: -96.757479917703 hartree
chargesum: -0.0000000
charge: -0.394709 -0.292582 -0.488226 -0.136679 -0.152590 -0.181602 0.333231 0.085379 -0.112357 -0.333060 -0.380003 -0.309019 -0.117164 -0.120388 -0.178483 0.026221 -0.266708 -0.180391 0.469187 0.157492 -0.263869 -0.252113 0.062497 0.071167 0.076593 0.075411 0.069091 0.082358 0.038743 0.093749 0.080238 0.095928 0.097515 0.100012 0.103311 0.102656 0.104293 0.089374 0.082448 0.092010 0.118320 0.089551 0.116107 0.087388 0.114304 0.104729 0.105882 0.108561 0.113641 0.061588 0.094509 0.088937 0.095222 0.095871 0.087529 0.088896
qa: -0.3947 -0.2926 -0.4882 -0.1367 -0.1526 -0.1816 0.3332 0.0854 -0.1124 -0.3331 -0.3800 -0.3090 -0.1172 -0.1204 -0.1785 0.0262 -0.2667 -0.1804 0.4692 0.1575 -0.2639 -0.2521 0.0625 0.0712 0.0766 0.0754 0.0691 0.0824 0.0387 0.0937 0.0802 0.0959 0.0975 0.1000 0.1033 0.1027 0.1043 0.0894 0.0824 0.0920 0.1183 0.0896 0.1161 0.0874 0.1143 0.1047 0.1059 0.1086 0.1136 0.0616 0.0945 0.0889 0.0952 0.0959 0.0875 0.0889
va: 1.9560 2.1266 2.0131 3.8681 3.7606 3.9087 3.8350 3.7647 3.9120 3.9239 3.9455 3.9428 3.8599 3.9309 3.9146 3.6901 3.9208 3.7802 4.1740 3.8208 3.9061 3.9333 1.0344 1.0062 1.0256 1.0154 1.0110 1.0064 1.0230 1.0059 1.0155 1.0056 1.0021 1.0086 0.9980 1.0028 0.9991 1.0044 1.0019 1.0041 1.0066 0.9810 0.9920 0.9828 1.0222 0.9967 0.9951 1.0366 1.0339 1.0238 1.0173 1.0068 1.0060 1.0084 1.0070 1.0057
dispcorr: -0.023487709 hartree
energy: -970.311777034305
dipole: -20.90682 19.65379 -1.25303 13.27027 -12.81530 0.45498 5.95455 -4.92653 1.02802
magnitude: 1.68343 au
magnitude: 4.27893 debye
