program: Orca
programVersion: 5.0.2
elementType: O O O C C C C C C C C C C C C C C C C C C C H H H H H H H H H H H H H H H H H H H H H H H H H H H H H H H H H H
charge: 0
multiplicity: 1
keywords: wb97x-d3
keywords: def2-TZVPP
keywords: def2/J RIJCOSX
keywords: DEFGRID2
keywords: scfconv7
keywords: smallprint printgap noloewdin
keywords: NOSOSCF
formula: C19H34O3
InChI: InChI=1/C19H34O3/c1-15(2)22-18(20)14-17(4)11-8-10-16(3)12-9-13-19(5,6)21-7/h8,11,14-16H,9-10,12-13H2,1-7H3
56 atoms
O  -0.680032 1.851838 -0.798202
O  3.709463 -0.246618 0.596337
O  3.252599 -0.419087 -1.585965
C  -3.252824 0.43634 -0.574225
C  -2.947499 1.88564 -0.174637
C  -3.875175 -0.414815 0.532097
C  -1.521375 2.196201 0.303411
C  -4.142983 -1.875632 0.142583
C  -2.920189 -2.785278 0.359635
C  -1.144418 1.388222 1.543757
C  -1.435252 3.689138 0.619911
C  -5.32439 -2.437772 0.926033
C  -1.720323 -2.389109 -0.427149
C  0.678741 2.201715 -0.714458
C  -0.536533 -2.067419 0.1054
C  0.614801 -1.577024 -0.64616
C  0.476656 -1.477986 -2.132047
C  1.69466 -1.199521 0.072541
C  2.93311 -0.597815 -0.429498
C  4.950406 0.441274 0.342247
C  4.686094 1.922872 0.151752
C  5.841678 0.159899 1.532574
H  -2.352409 -0.037882 -0.966045
H  -3.957138 0.449689 -1.411354
H  -3.645113 2.204928 0.606062
H  -3.145138 2.540125 -1.029198
H  -4.824075 0.054008 0.814485
H  -3.25893 -0.393824 1.436331
H  -4.401797 -1.907453 -0.923333
H  -3.204001 -3.804538 0.072298
H  -2.677444 -2.815326 1.42654
H  -1.858457 1.567467 2.348784
H  -0.160257 1.664415 1.92724
H  -1.131593 0.317283 1.339917
H  -0.459058 3.976881 1.014459
H  -1.636428 4.297655 -0.264672
H  -2.174154 3.955608 1.377095
H  -5.142241 -2.39467 2.002938
H  -5.519621 -3.4806 0.667525
H  -6.236859 -1.873526 0.725101
H  -1.857819 -2.347548 -1.504034
H  1.179251 1.749364 -1.571236
H  1.1705 1.837627 0.193527
H  0.844002 3.283213 -0.772962
H  -0.419565 -2.11748 1.184666
H  0.15257 -2.432278 -2.550335
H  -0.293954 -0.746112 -2.385382
H  1.393648 -1.186965 -2.628773
H  1.645587 -1.305674 1.150636
H  5.412685 0.028574 -0.55735
H  4.22573 2.357599 1.040989
H  5.627025 2.444883 -0.026765
H  4.038131 2.120343 -0.702906
H  6.811565 0.63487 1.384278
H  6.014612 -0.909848 1.65774
H  5.416051 0.551747 2.458039
elementType: O C H
totalener: -970.28418351 hartree
nucrepener: 1970.15969198 hartree
electener: -2940.44387549 hartree
oneelecener: -5233.31984057 hartree
twoeener: 2292.87596508 hartree
cpcmener: -0.02160791 hartree
kineticenergy: 965.59731488 hartree
xcener: -96.763150377313 hartree
chargesum: 0.0000000
charge: -0.396576 -0.287613 -0.485310 -0.086820 -0.192435 -0.212488 0.379539 0.079817 -0.128116 -0.412104 -0.337991 -0.305796 -0.075674 -0.143751 -0.212740 0.022412 -0.281573 -0.174823 0.443511 0.164738 -0.278147 -0.253496 0.035663 0.081693 0.073052 0.090038 0.076219 0.082790 0.041723 0.092547 0.079054 0.113025 0.108779 0.094819 0.099057 0.100849 0.100275 0.087279 0.088839 0.088186 0.129174 0.115156 0.090423 0.112193 0.118460 0.114262 0.109921 0.115750 0.113042 0.060622 0.090976 0.104287 0.094022 0.089334 0.096211 0.087720
qa: -0.3966 -0.2876 -0.4853 -0.0868 -0.1924 -0.2125 0.3795 0.0798 -0.1281 -0.4121 -0.3380 -0.3058 -0.0757 -0.1438 -0.2127 0.0224 -0.2816 -0.1748 0.4435 0.1647 -0.2781 -0.2535 0.0357 0.0817 0.0731 0.0900 0.0762 0.0828 0.0417 0.0925 0.0791 0.1130 0.1088 0.0948 0.0991 0.1008 0.1003 0.0873 0.0888 0.0882 0.1292 0.1152 0.0904 0.1122 0.1185 0.1143 0.1099 0.1157 0.1130 0.0606 0.0910 0.1043 0.0940 0.0893 0.0962 0.0877
va: 1.9511 2.1189 2.0047 3.8387 3.8453 3.9104 3.7712 3.7572 3.9311 3.9602 3.9158 3.9387 3.8195 3.9403 3.9020 3.6303 3.8974 3.7274 4.1783 3.8163 3.9013 3.9345 1.0492 1.0092 1.0159 1.0181 1.0095 1.0035 1.0226 1.0059 1.0134 1.0056 1.0043 0.9928 0.9989 1.0079 1.0054 0.9999 1.0048 1.0048 0.9992 0.9937 0.9769 0.9875 1.0165 0.9995 0.9957 1.0361 1.0354 1.0248 1.0054 1.0086 1.0134 1.0058 1.0083 1.0068
dispcorr: -0.031220293 hartree
energy: -970.315403805962
dipole: -13.70255 12.98707 -0.71548 8.06732 -7.82762 0.23970 7.30820 -6.03039 1.27781
magnitude: 1.48397 au
magnitude: 3.77196 debye
