program: Orca
programVersion: 5.0.2
elementType: O O O C C C C C C C C C C C C C C C C C C C H H H H H H H H H H H H H H H H H H H H H H H H H H H H H H H H H H
charge: 0
multiplicity: 1
keywords: wb97x-d3
keywords: def2-TZVPP
keywords: def2/J RIJCOSX
keywords: DEFGRID2
keywords: scfconv7
keywords: smallprint printgap noloewdin
keywords: NOSOSCF
formula: C19H34O3
InChI: InChI=1/C19H34O3/c1-15(2)22-18(20)14-17(4)11-8-10-16(3)12-9-13-19(5,6)21-7/h8,11,14-16H,9-10,12-13H2,1-7H3
56 atoms
O  -0.568534 1.834205 0.324983
O  3.380461 -0.090612 -0.174969
O  3.925758 -1.189135 1.693432
C  -3.083912 0.429498 -0.198572
C  -2.858616 1.605784 0.745762
C  -3.910458 -0.676454 0.451038
C  -1.772996 2.599794 0.319495
C  -4.01906 -1.968436 -0.36831
C  -2.812732 -2.900709 -0.152457
C  -1.706106 3.728417 1.346469
C  -2.064557 3.177636 -1.064371
C  -5.298254 -2.722184 -0.020948
C  -1.500002 -2.328926 -0.564984
C  0.626331 2.483847 -0.024592
C  -0.446773 -2.176842 0.245539
C  0.830511 -1.572533 -0.130769
C  0.974691 -1.104363 -1.545188
C  1.766955 -1.489149 0.839568
C  3.121962 -0.927181 0.822764
C  4.683676 0.524165 -0.272424
C  5.65285 -0.422188 -0.952423
C  4.48708 1.808943 -1.048365
H  -2.121657 0.031278 -0.519509
H  -3.593459 0.763447 -1.107445
H  -2.586619 1.222235 1.735839
H  -3.796604 2.151942 0.883492
H  -4.916034 -0.287753 0.644947
H  -3.492127 -0.916915 1.43586
H  -4.059843 -1.7056 -1.432681
H  -2.98526 -3.812529 -0.73641
H  -2.777309 -3.203802 0.898763
H  -2.669256 4.236818 1.411051
H  -0.964164 4.48568 1.08714
H  -1.466393 3.345308 2.340852
H  -3.063735 3.615959 -1.085845
H  -1.364504 3.970234 -1.334929
H  -2.021346 2.415551 -1.844484
H  -6.18296 -2.120272 -0.236001
H  -5.327681 -2.980972 1.04063
H  -5.386803 -3.65107 -0.587987
H  -1.431407 -2.022839 -1.605049
H  1.418895 1.738234 0.033968
H  0.890979 3.298799 0.658369
H  0.622976 2.884174 -1.044216
H  -0.540831 -2.48978 1.282044
H  0.337739 -0.233992 -1.720021
H  1.989449 -0.836791 -1.812296
H  0.643758 -1.881225 -2.235432
H  1.525045 -1.921007 1.804967
H  5.040063 0.760553 0.732752
H  5.788201 -1.345819 -0.389762
H  5.314283 -0.676579 -1.95859
H  6.630319 0.053865 -1.039479
H  3.792532 2.481987 -0.54287
H  4.112016 1.618688 -2.055648
H  5.440677 2.329244 -1.140931
elementType: O C H
totalener: -970.28391597 hartree
nucrepener: 1941.85855809 hartree
electener: -2912.14247406 hartree
oneelecener: -5176.58989040 hartree
twoeener: 2264.44741634 hartree
cpcmener: -0.02430631 hartree
kineticenergy: 965.60186159 hartree
xcener: -96.760979524100 hartree
chargesum: 0.0000000
charge: -0.383950 -0.290299 -0.490728 -0.102096 -0.176567 -0.180512 0.326448 0.081394 -0.125719 -0.335600 -0.374853 -0.305798 -0.109179 -0.104808 -0.160990 -0.011397 -0.262605 -0.164035 0.460603 0.150345 -0.264455 -0.267831 0.035149 0.075779 0.076856 0.081982 0.079236 0.069780 0.042076 0.091832 0.078604 0.096855 0.097346 0.100270 0.103699 0.103682 0.102494 0.088585 0.086995 0.088755 0.128871 0.070455 0.103653 0.096658 0.110556 0.107975 0.103990 0.113704 0.112100 0.072009 0.095042 0.089458 0.099349 0.095561 0.092815 0.100463
qa: -0.3840 -0.2903 -0.4907 -0.1021 -0.1766 -0.1805 0.3264 0.0814 -0.1257 -0.3356 -0.3749 -0.3058 -0.1092 -0.1048 -0.1610 -0.0114 -0.2626 -0.1640 0.4606 0.1503 -0.2645 -0.2678 0.0351 0.0758 0.0769 0.0820 0.0792 0.0698 0.0421 0.0918 0.0786 0.0969 0.0973 0.1003 0.1037 0.1037 0.1025 0.0886 0.0870 0.0888 0.1289 0.0705 0.1037 0.0967 0.1106 0.1080 0.1040 0.1137 0.1121 0.0720 0.0950 0.0895 0.0993 0.0956 0.0928 0.1005
va: 1.9609 2.1079 2.0077 3.8275 3.7963 3.9154 3.8470 3.7575 3.9295 3.9174 3.9491 3.9372 3.8679 3.9214 3.9033 3.7155 3.9112 3.8243 4.1558 3.8034 3.9195 3.9322 1.0545 1.0124 1.0250 1.0153 1.0057 1.0096 1.0221 1.0055 1.0139 1.0060 1.0028 1.0089 1.0032 1.0008 0.9977 1.0044 1.0001 1.0049 1.0009 1.0130 0.9899 0.9808 1.0224 0.9974 1.0296 1.0003 1.0331 1.0245 1.0173 1.0046 1.0063 1.0041 1.0038 1.0078
dispcorr: -0.029173861 hartree
energy: -970.313089831937
dipole: -16.28736 15.03789 -1.24947 10.92533 -9.80622 1.11911 -8.10560 6.40672 -1.69888
magnitude: 2.38742 au
magnitude: 6.06834 debye
