program: Orca
programVersion: 5.0.2
elementType: O O O C C C C C C C C C C C C C C C C C C C H H H H H H H H H H H H H H H H H H H H H H H H H H H H H H H H H H
charge: 0
multiplicity: 1
keywords: wb97x-d3
keywords: def2-TZVPP
keywords: def2/J RIJCOSX
keywords: DEFGRID2
keywords: scfconv7
keywords: smallprint printgap noloewdin
keywords: NOSOSCF
formula: C19H34O3
InChI: InChI=1/C19H34O3/c1-15(2)22-18(20)14-17(4)11-8-10-16(3)12-9-13-19(5,6)21-7/h8,11,14-16H,9-10,12-13H2,1-7H3
56 atoms
O  -6.520789 2.095723 1.304279
O  5.985512 -2.004684 -0.843821
O  5.237325 -2.795339 1.109424
C  -3.908047 1.772617 0.003388
C  -5.253227 2.033372 -0.668772
C  -3.038358 0.816817 -0.808704
C  -6.254014 2.871405 0.137011
C  -1.725453 0.42695 -0.1260
C  -1.021907 -0.6874 -0.9188
C  -7.525934 3.055096 -0.691206
C  -5.669158 4.23938 0.488619
C  -0.797033 1.620345 0.066091
C  0.130622 -1.274125 -0.177845
C  -7.352876 2.657944 2.286386
C  1.395626 -1.290532 -0.61012
C  2.52845 -1.84938 0.125094
C  2.256357 -2.433421 1.475291
C  3.736014 -1.7855 -0.476294
C  5.024143 -2.254969 0.045697
C  7.349103 -2.350773 -0.528831
C  8.053177 -2.548664 -1.85402
C  7.981709 -1.251714 0.3039
H  -4.064207 1.349598 1.000014
H  -3.380555 2.718427 0.149872
H  -5.728352 1.074557 -0.907231
H  -5.086135 2.532843 -1.627922
H  -2.820818 1.256616 -1.789301
H  -3.612503 -0.095011 -1.007031
H  -1.972347 0.020409 0.863271
H  -0.700343 -0.306599 -1.893344
H  -1.748581 -1.48453 -1.113803
H  -8.276588 3.654354 -0.172612
H  -7.977187 2.093013 -0.943566
H  -7.29966 3.570598 -1.625848
H  -6.412122 4.901964 0.936066
H  -4.831743 4.163229 1.18388
H  -5.305711 4.735144 -0.412748
H  -0.537621 2.071916 -0.895557
H  0.13588 1.331473 0.553535
H  -1.249605 2.396887 0.683411
H  -0.114632 -1.703328 0.790334
H  -8.365326 2.873796 1.927588
H  -6.947357 3.576266 2.724064
H  -7.439498 1.924184 3.089355
H  1.622466 -0.855914 -1.579987
H  1.804945 -1.68322 2.127277
H  1.537811 -3.251534 1.395186
H  3.145475 -2.81273 1.963469
H  3.786139 -1.331418 -1.459958
H  7.361276 -3.290175 0.028866
H  9.089426 -2.838141 -1.67894
H  7.58428 -3.338705 -2.44209
H  8.058701 -1.632453 -2.44778
H  9.015771 -1.512895 0.532271
H  7.465142 -1.10445 1.252697
H  7.98756 -0.303015 -0.236129
elementType: O C H
totalener: -970.28912318 hartree
nucrepener: 1711.35284755 hartree
electener: -2681.64197073 hartree
oneelecener: -4715.37801830 hartree
twoeener: 2033.73604757 hartree
cpcmener: -0.02233205 hartree
kineticenergy: 965.58642697 hartree
xcener: -96.756316576809 hartree
chargesum: 0.0000000
charge: -0.395369 -0.293370 -0.488826 -0.129598 -0.152706 -0.177945 0.331507 0.102151 -0.101372 -0.331808 -0.382653 -0.337294 -0.159651 -0.119125 -0.142289 0.016889 -0.266432 -0.183582 0.472031 0.157828 -0.252136 -0.264038 0.064313 0.071403 0.076215 0.074875 0.070861 0.071769 0.041111 0.078208 0.092917 0.097509 0.099002 0.096154 0.104853 0.103544 0.104123 0.084318 0.097718 0.096286 0.122639 0.086753 0.089785 0.116059 0.112186 0.104161 0.105559 0.108928 0.113580 0.061601 0.088875 0.096253 0.087794 0.094956 0.094544 0.088937
qa: -0.3954 -0.2934 -0.4888 -0.1296 -0.1527 -0.1779 0.3315 0.1022 -0.1014 -0.3318 -0.3827 -0.3373 -0.1597 -0.1191 -0.1423 0.0169 -0.2664 -0.1836 0.4720 0.1578 -0.2521 -0.2640 0.0643 0.0714 0.0762 0.0749 0.0709 0.0718 0.0411 0.0782 0.0929 0.0975 0.0990 0.0962 0.1049 0.1035 0.1041 0.0843 0.0977 0.0963 0.1226 0.0868 0.0898 0.1161 0.1122 0.1042 0.1056 0.1089 0.1136 0.0616 0.0889 0.0963 0.0878 0.0950 0.0945 0.0889
va: 1.9544 2.1270 2.0116 3.8611 3.7727 3.9138 3.8352 3.7525 3.9189 3.9271 3.9448 3.9529 3.8895 3.9307 3.9199 3.7010 3.9203 3.7820 4.1717 3.8185 3.9313 3.9099 1.0330 1.0035 1.0250 1.0154 1.0089 1.0135 1.0230 1.0169 1.0065 1.0029 1.0092 1.0054 0.9985 0.9972 1.0030 1.0026 1.0024 1.0029 1.0054 0.9830 0.9811 0.9921 1.0238 0.9961 0.9957 1.0371 1.0337 1.0246 1.0057 1.0085 1.0070 1.0062 1.0162 1.0067
dispcorr: -0.023084822 hartree
energy: -970.312208000470
dipole: -23.70711 22.72946 -0.97766 17.83282 -16.63641 1.19641 -1.03873 0.27811 -0.76062
magnitude: 1.72214 au
magnitude: 4.37733 debye
