program: Orca
programVersion: 5.0.2
elementType: O O O C C C C C C C C C C C C C C C C C C C H H H H H H H H H H H H H H H H H H H H H H H H H H H H H H H H H H
charge: 0
multiplicity: 1
keywords: wb97x-d3
keywords: def2-TZVPP
keywords: def2/J RIJCOSX
keywords: DEFGRID2
keywords: scfconv7
keywords: smallprint printgap noloewdin
keywords: NOSOSCF
formula: C19H34O3
InChI: InChI=1/C19H34O3/c1-15(2)22-18(20)14-17(4)11-8-10-16(3)12-9-13-19(5,6)21-7/h8,11,14-16H,9-10,12-13H2,1-7H3
56 atoms
O  -3.096876 3.524417 -1.002407
O  4.584705 -1.186591 0.689704
O  4.201756 -1.179294 -1.514454
C  -3.557891 0.830631 0.222844
C  -3.015219 2.053451 0.956266
C  -2.849364 -0.446785 0.659286
C  -3.429254 3.41637 0.381271
C  -3.318373 -1.710983 -0.062756
C  -2.300495 -2.853357 0.113973
C  -2.769929 4.527866 1.197205
C  -4.942935 3.590486 0.422537
C  -4.696451 -2.159068 0.407467
C  -1.02883 -2.581582 -0.613647
C  -1.737084 3.45688 -1.350737
C  0.154015 -2.367241 -0.028606
C  1.387983 -2.009507 -0.724137
C  1.337195 -1.905402 -2.215277
C  2.470666 -1.774767 0.047985
C  3.809015 -1.356391 -0.381311
C  5.949174 -0.752821 0.518572
C  6.001256 0.753949 0.350964
C  6.696259 -1.221261 1.748913
H  -3.425886 0.950351 -0.857053
H  -4.635041 0.743975 0.390544
H  -1.921481 1.994758 0.99014
H  -3.334465 2.021228 2.002793
H  -2.964166 -0.589621 1.74082
H  -1.776896 -0.309805 0.488639
H  -3.380908 -1.487864 -1.135503
H  -2.741186 -3.777563 -0.275349
H  -2.109741 -3.016188 1.179349
H  -3.144759 4.515872 2.221623
H  -2.989021 5.512157 0.7780
H  -1.6852 4.418438 1.25421
H  -5.454877 2.859068 -0.204995
H  -5.316126 3.474262 1.4406
H  -5.231726 4.584826 0.075166
H  -5.441939 -1.370004 0.296924
H  -4.677031 -2.44761 1.46166
H  -5.050385 -3.0202 -0.162832
H  -1.117453 -2.518023 -1.694747
H  -1.150452 4.29744 -0.964181
H  -1.684414 3.493929 -2.44012
H  -1.248549 2.530199 -1.030364
H  0.216958 -2.428103 1.054682
H  0.992539 -2.84573 -2.649518
H  0.618031 -1.140217 -2.514762
H  2.293969 -1.659998 -2.659235
H  2.355615 -1.884324 1.120701
H  6.369657 -1.237589 -0.365854
H  5.453734 1.090709 -0.529385
H  5.592684 1.262166 1.226541
H  7.037252 1.074122 0.232909
H  6.298675 -0.766092 2.65789
H  7.7469 -0.94212 1.669324
H  6.649893 -2.305777 1.857001
elementType: O C H
totalener: -970.28862655 hartree
nucrepener: 1802.36616721 hartree
electener: -2772.65479375 hartree
oneelecener: -4897.11766264 hartree
twoeener: 2124.46286888 hartree
cpcmener: -0.02248136 hartree
kineticenergy: 965.59867282 hartree
xcener: -96.758494576597 hartree
chargesum: -0.0000000
charge: -0.410603 -0.292662 -0.488415 -0.152806 -0.254088 -0.178501 0.382986 0.079075 -0.110799 -0.336321 -0.318623 -0.306644 -0.116532 -0.125960 -0.179450 0.026217 -0.266552 -0.181049 0.469759 0.158170 -0.263972 -0.252051 0.067762 0.081246 0.086835 0.092312 0.072382 0.081850 0.039233 0.093470 0.079852 0.097153 0.102658 0.097811 0.095189 0.089423 0.099154 0.089157 0.082042 0.092332 0.118431 0.093889 0.120772 0.086004 0.114465 0.105038 0.105471 0.108819 0.113592 0.061352 0.094322 0.088916 0.095444 0.087666 0.088927 0.095850
qa: -0.4106 -0.2927 -0.4884 -0.1528 -0.2541 -0.1785 0.3830 0.0791 -0.1108 -0.3363 -0.3186 -0.3066 -0.1165 -0.1260 -0.1795 0.0262 -0.2666 -0.1810 0.4698 0.1582 -0.2640 -0.2521 0.0678 0.0812 0.0868 0.0923 0.0724 0.0819 0.0392 0.0935 0.0799 0.0972 0.1027 0.0978 0.0952 0.0894 0.0992 0.0892 0.0820 0.0923 0.1184 0.0939 0.1208 0.0860 0.1145 0.1050 0.1055 0.1088 0.1136 0.0614 0.0943 0.0889 0.0954 0.0877 0.0889 0.0959
va: 1.9325 2.1273 2.0128 3.8594 3.8316 3.9077 3.7866 3.7707 3.9102 3.9193 3.9084 3.9427 3.8591 3.9286 3.9115 3.6880 3.9206 3.7795 4.1747 3.8197 3.9066 3.9331 1.0232 1.0083 0.9994 1.0131 1.0118 1.0048 1.0227 1.0058 1.0155 1.0060 1.0082 0.9987 1.0062 1.0049 1.0102 1.0050 1.0021 1.0040 1.0066 0.9850 0.9905 0.9809 1.0222 0.9964 0.9953 1.0366 1.0340 1.0239 1.0172 1.0068 1.0060 1.0070 1.0057 1.0084
dispcorr: -0.024027607 hartree
energy: -970.312654152644
dipole: -17.79868 17.40749 -0.39119 10.45441 -10.66151 -0.20710 6.49448 -5.27296 1.22152
magnitude: 1.29925 au
magnitude: 3.30242 debye
