program: Orca
programVersion: 5.0.2
elementType: O O O C C C C C C C C C C C C C C C C C C C H H H H H H H H H H H H H H H H H H H H H H H H H H H H H H H H H H
charge: 0
multiplicity: 1
keywords: wb97x-d3
keywords: def2-TZVPP
keywords: def2/J RIJCOSX
keywords: DEFGRID2
keywords: scfconv7
keywords: smallprint printgap noloewdin
keywords: NOSOSCF
formula: C19H34O3
InChI: InChI=1/C19H34O3/c1-15(2)22-18(20)14-17(4)11-8-10-16(3)12-9-13-19(5,6)21-7/h8,11,14-16H,9-10,12-13H2,1-7H3
56 atoms
O  -0.915588 2.335046 -0.534854
O  4.086494 -0.771059 0.501351
O  3.311301 0.04883 -1.428181
C  -3.176247 0.41154 0.001311
C  -2.888622 1.69479 0.77085
C  -3.701297 -0.700036 0.905388
C  -2.166796 2.794978 -0.021627
C  -3.959201 -2.037428 0.197199
C  -2.701086 -2.921003 0.119328
C  -1.986728 4.022527 0.871058
C  -2.961011 3.19049 -1.261521
C  -5.069681 -2.814603 0.895111
C  -1.552511 -2.296514 -0.593533
C  0.090843 2.015077 0.392769
C  -0.340559 -2.107136 -0.059786
C  0.77147 -1.430716 -0.721348
C  0.534807 -0.900174 -2.099641
C  1.916445 -1.304269 -0.014941
C  3.137925 -0.603552 -0.420817
C  5.364526 -0.127594 0.321432
C  5.284345 1.321292 0.763147
C  6.358017 -0.924702 1.138293
H  -2.271031 0.080346 -0.509604
H  -3.914528 0.600198 -0.783701
H  -2.304043 1.454617 1.665969
H  -3.827783 2.1135 1.146738
H  -4.633929 -0.354495 1.364387
H  -3.005444 -0.860784 1.73757
H  -4.289194 -1.828203 -0.827897
H  -2.971524 -3.8449 -0.405628
H  -2.400809 -3.211503 1.131078
H  -2.957587 4.465268 1.097682
H  -1.384247 4.78817 0.378209
H  -1.5160 3.783946 1.826588
H  -3.025418 2.373851 -1.982163
H  -3.978419 3.477794 -0.993696
H  -2.498649 4.041215 -1.76681
H  -6.005363 -2.252718 0.894852
H  -4.811875 -3.022243 1.936822
H  -5.261399 -3.772342 0.406847
H  -1.75006 -1.975369 -1.612415
H  -0.185143 1.202993 1.073927
H  0.401267 2.871533 1.000941
H  0.961993 1.690414 -0.178174
H  -0.162395 -2.439662 0.959342
H  -0.225364 -0.115673 -2.073173
H  1.425348 -0.489125 -2.558049
H  0.15089 -1.686954 -2.750864
H  1.952282 -1.748202 0.973726
H  5.644906 -0.178379 -0.733305
H  6.260803 1.793932 0.649094
H  4.573529 1.895862 0.169303
H  4.997381 1.397824 1.813503
H  7.355719 -0.503781 1.013168
H  6.397274 -1.966098 0.816015
H  6.116889 -0.900727 2.202607
elementType: O C H
totalener: -970.28744465 hartree
nucrepener: 1911.25583461 hartree
electener: -2881.54327926 hartree
oneelecener: -5115.36907776 hartree
twoeener: 2233.82579850 hartree
cpcmener: -0.02207993 hartree
kineticenergy: 965.60174578 hartree
xcener: -96.761515654982 hartree
chargesum: -0.0000000
charge: -0.406179 -0.293564 -0.492410 -0.094429 -0.269009 -0.181264 0.392984 0.076976 -0.131723 -0.343384 -0.323157 -0.305764 -0.102904 -0.126678 -0.169073 0.002701 -0.271576 -0.189393 0.481966 0.157144 -0.263673 -0.252811 0.031665 0.077715 0.085646 0.091851 0.078804 0.072165 0.042586 0.092923 0.077823 0.099096 0.103866 0.099208 0.095813 0.091119 0.099990 0.088748 0.087438 0.088612 0.129734 0.087231 0.109555 0.104565 0.112370 0.103867 0.114675 0.113035 0.111887 0.061862 0.095412 0.093953 0.088942 0.089563 0.095788 0.087712
qa: -0.4062 -0.2936 -0.4924 -0.0944 -0.2690 -0.1813 0.3930 0.0770 -0.1317 -0.3434 -0.3232 -0.3058 -0.1029 -0.1267 -0.1691 0.0027 -0.2716 -0.1894 0.4820 0.1571 -0.2637 -0.2528 0.0317 0.0777 0.0856 0.0919 0.0788 0.0722 0.0426 0.0929 0.0778 0.0991 0.1039 0.0992 0.0958 0.0911 0.1000 0.0887 0.0874 0.0886 0.1297 0.0872 0.1096 0.1046 0.1124 0.1039 0.1147 0.1130 0.1119 0.0619 0.0954 0.0940 0.0889 0.0896 0.0958 0.0877
va: 1.9348 2.1322 1.9948 3.8405 3.8585 3.9048 3.7668 3.7601 3.9392 3.9181 3.9208 3.9378 3.8659 3.9276 3.8852 3.6843 3.8961 3.7750 4.1387 3.8211 3.9040 3.9355 1.0384 1.0140 1.0030 1.0133 1.0062 1.0096 1.0224 1.0055 1.0134 1.0059 1.0081 0.9971 1.0037 1.0045 1.0090 1.0042 1.0001 1.0046 0.9985 0.9774 0.9893 1.0013 1.0230 1.0066 1.0356 0.9986 1.0354 1.0233 1.0062 1.0167 1.0070 1.0055 1.0084 1.0068
dispcorr: -0.028231226 hartree
energy: -970.315675873815
dipole: -16.17229 15.21659 -0.95569 6.46804 -6.88004 -0.41200 6.83335 -5.56010 1.27325
magnitude: 1.64446 au
magnitude: 4.17989 debye
