program: Orca
programVersion: 5.0.2
elementType: O O O C C C C C C C C C C C C C C C C C C C H H H H H H H H H H H H H H H H H H H H H H H H H H H H H H H H H H
charge: 0
multiplicity: 1
keywords: wb97x-d3
keywords: def2-TZVPP
keywords: def2/J RIJCOSX
keywords: DEFGRID2
keywords: scfconv7
keywords: smallprint printgap noloewdin
keywords: NOSOSCF
formula: C19H34O3
InChI: InChI=1/C19H34O3/c1-15(2)22-18(20)14-17(4)11-8-10-16(3)12-9-13-19(5,6)21-7/h8,11,14-16H,9-10,12-13H2,1-7H3
56 atoms
O  -3.19636 3.534727 -1.021397
O  4.633349 -1.23573 0.693731
O  4.221748 -1.140405 -1.502758
C  -3.579342 0.834555 0.219977
C  -3.043159 2.069775 0.936979
C  -2.844753 -0.429686 0.651541
C  -3.498472 3.422302 0.368949
C  -3.304499 -1.704585 -0.05754
C  -2.274012 -2.834734 0.122318
C  -2.847609 4.549837 1.169433
C  -5.01447 3.562997 0.4414
C  -4.6751 -2.163997 0.423585
C  -1.003834 -2.550771 -0.603222
C  -1.842636 3.500331 -1.396913
C  0.180256 -2.344225 -0.017872
C  1.413054 -1.980111 -0.71228
C  1.355061 -1.847544 -2.200955
C  2.502033 -1.769699 0.058108
C  3.841111 -1.354596 -0.37195
C  6.001279 -0.814107 0.518504
C  6.072104 0.696529 0.399548
C  6.758267 -1.332714 1.722438
H  -3.467956 0.950171 -0.862702
H  -4.651923 0.733103 0.407111
H  -1.948041 2.032965 0.944565
H  -3.336683 2.033974 1.990896
H  -2.941546 -0.568914 1.735325
H  -1.777078 -0.277461 0.464437
H  -3.375126 -1.490686 -1.131677
H  -2.704032 -3.763994 -0.267167
H  -2.083268 -2.995125 1.18807
H  -1.760148 4.462157 1.208493
H  -3.205121 4.534839 2.199953
H  -3.093327 5.527722 0.750052
H  -5.332557 4.552203 0.10518
H  -5.522769 2.823249 -0.179208
H  -5.363995 3.433652 1.466243
H  -5.431187 -1.386218 0.305801
H  -4.648275 -2.438937 1.481245
H  -5.019835 -3.036795 -0.13448
H  -1.094229 -2.473776 -1.683326
H  -1.269229 4.355327 -1.022547
H  -1.812714 3.537754 -2.487081
H  -1.324865 2.586364 -1.086208
H  0.24586 -2.419378 1.064349
H  0.632774 -1.078567 -2.482508
H  2.309115 -1.592012 -2.644914
H  1.010215 -2.780424 -2.650941
H  2.393166 -1.902426 1.128839
H  6.403537 -1.275132 -0.386846
H  7.110885 1.006139 0.277752
H  5.51776 1.06944 -0.46168
H  5.68245 1.181242 1.296776
H  7.811728 -1.066262 1.636538
H  6.697445 -2.419381 1.796187
H  6.380342 -0.901514 2.651235
elementType: O C H
totalener: -970.28875124 hartree
nucrepener: 1799.32715586 hartree
electener: -2769.61590710 hartree
oneelecener: -4891.04575155 hartree
twoeener: 2121.42984445 hartree
cpcmener: -0.02246431 hartree
kineticenergy: 965.59973975 hartree
xcener: -96.758831483153 hartree
chargesum: 0.0000000
charge: -0.410514 -0.292778 -0.488639 -0.152486 -0.254186 -0.178249 0.384567 0.079947 -0.110904 -0.336915 -0.319553 -0.307524 -0.118410 -0.126258 -0.177962 0.026867 -0.266836 -0.181604 0.470418 0.158514 -0.264040 -0.252107 0.067762 0.081389 0.086760 0.092220 0.072170 0.081562 0.039064 0.093595 0.079816 0.097922 0.097173 0.102833 0.098986 0.094991 0.089896 0.089241 0.082199 0.092331 0.118724 0.093779 0.120760 0.086207 0.113992 0.105309 0.108980 0.105244 0.113513 0.061247 0.095466 0.094237 0.088853 0.088998 0.095860 0.087573
qa: -0.4105 -0.2928 -0.4886 -0.1525 -0.2542 -0.1782 0.3846 0.0799 -0.1109 -0.3369 -0.3196 -0.3075 -0.1184 -0.1263 -0.1780 0.0269 -0.2668 -0.1816 0.4704 0.1585 -0.2640 -0.2521 0.0678 0.0814 0.0868 0.0922 0.0722 0.0816 0.0391 0.0936 0.0798 0.0979 0.0972 0.1028 0.0990 0.0950 0.0899 0.0892 0.0822 0.0923 0.1187 0.0938 0.1208 0.0862 0.1140 0.1053 0.1090 0.1052 0.1135 0.0612 0.0955 0.0942 0.0889 0.0890 0.0959 0.0876
va: 1.9326 2.1274 2.0123 3.8607 3.8321 3.9058 3.7839 3.7711 3.9096 3.9195 3.9088 3.9429 3.8608 3.9288 3.9119 3.6883 3.9205 3.7808 4.1740 3.8193 3.9063 3.9331 1.0231 1.0080 0.9996 1.0130 1.0119 1.0055 1.0227 1.0057 1.0156 0.9985 1.0060 1.0081 1.0101 1.0063 1.0048 1.0049 1.0021 1.0040 1.0065 0.9849 0.9905 0.9808 1.0225 0.9955 1.0367 0.9962 1.0339 1.0238 1.0060 1.0173 1.0068 1.0057 1.0084 1.0071
dispcorr: -0.023992158 hartree
energy: -970.312743399545
dipole: -17.88643 17.51672 -0.36971 10.32778 -10.55670 -0.22892 6.44198 -5.23356 1.20841
magnitude: 1.28427 au
magnitude: 3.26437 debye
