program: Orca
programVersion: 5.0.2
elementType: O O O C C C C C C C C C C C C C C C C C C C H H H H H H H H H H H H H H H H H H H H H H H H H H H H H H H H H H
charge: 0
multiplicity: 1
keywords: wb97x-d3
keywords: def2-TZVPP
keywords: def2/J RIJCOSX
keywords: DEFGRID2
keywords: scfconv7
keywords: smallprint printgap noloewdin
keywords: NOSOSCF
formula: C19H34O3
56 atoms
O  -4.15628 3.527473 -1.132764
O  5.020177 -1.588875 0.700989
O  4.517152 -0.992753 -1.395159
C  -3.775761 0.885426 0.208024
C  -3.314586 2.228276 0.764434
C  -2.810536 -0.236286 0.575122
C  -4.106776 3.456196 0.29165
C  -3.15804 -1.59809 -0.027176
C  -2.013238 -2.600934 0.181944
C  -3.485703 4.718356 0.889009
C  -5.567306 3.365259 0.718937
C  -4.455031 -2.164579 0.537348
C  -0.757477 -2.200257 -0.514466
C  -2.940095 3.695504 -1.814976
C  0.443939 -2.107443 0.064828
C  1.678194 -1.715909 -0.612618
C  1.581412 -1.33045 -2.054425
C  2.809095 -1.736308 0.1255
C  4.16831 -1.394327 -0.305855
C  6.422317 -1.311323 0.507329
C  6.696141 0.162276 0.737697
C  7.168462 -2.199192 1.480123
H  -3.855989 0.937048 -0.88233
H  -4.778422 0.656276 0.57783
H  -2.254395 2.3683 0.526567
H  -3.361529 2.203072 1.857788
H  -2.74875 -0.333187 1.666121
H  -1.808201 0.055817 0.24382
H  -3.286278 -1.467579 -1.109502
H  -2.331853 -3.572379 -0.214519
H  -1.829204 -2.745071 1.251281
H  -3.592912 4.712119 1.974599
H  -3.979203 5.617903 0.514816
H  -2.418681 4.802838 0.674676
H  -6.077317 2.518848 0.256267
H  -5.645048 3.249336 1.800469
H  -6.112245 4.270526 0.443188
H  -4.688915 -3.134204 0.09308
H  -5.306418 -1.510412 0.346036
H  -4.384886 -2.306298 1.618933
H  -0.865061 -1.975759 -1.572454
H  -3.161168 3.638911 -2.881877
H  -2.201395 2.91828 -1.591198
H  -2.471908 4.667821 -1.626912
H  0.53269 -2.338633 1.122997
H  0.862944 -0.517989 -2.179191
H  2.526465 -1.013483 -2.476709
H  1.210555 -2.170006 -2.64573
H  2.72713 -2.044878 1.161525
H  6.702385 -1.582702 -0.513223
H  6.425482 0.460316 1.752308
H  7.759767 0.363274 0.603511
H  6.153393 0.795585 0.035887
H  6.911633 -1.968814 2.515572
H  8.242005 -2.050801 1.361929
H  6.959516 -3.254228 1.298706
elementType: O C H
totalener: -970.28947239 hartree
nucrepener: 1773.80907427 hartree
electener: -2744.09854666 hartree
oneelecener: -4840.00551027 hartree
twoeener: 2095.90696361 hartree
cpcmener: -0.02276000 hartree
kineticenergy: 965.60370692 hartree
xcener: -96.760019718484 hartree
chargesum: -0.0000000
charge: -0.412404 -0.293880 -0.489709 -0.151372 -0.249815 -0.173820 0.382913 0.089198 -0.116968 -0.333911 -0.320582 -0.319324 -0.142488 -0.127846 -0.150137 0.019494 -0.265580 -0.183415 0.472544 0.159611 -0.264429 -0.251845 0.069067 0.083054 0.086219 0.091328 0.070447 0.078398 0.038451 0.095074 0.080011 0.097833 0.102390 0.097723 0.094533 0.089474 0.099917 0.092276 0.091751 0.084618 0.124347 0.121593 0.086998 0.093660 0.111349 0.102829 0.109097 0.106260 0.113129 0.060442 0.088651 0.095185 0.094936 0.087861 0.088841 0.096024
qa: -0.4124 -0.2939 -0.4897 -0.1514 -0.2498 -0.1738 0.3829 0.0892 -0.1170 -0.3339 -0.3206 -0.3193 -0.1425 -0.1278 -0.1501 0.0195 -0.2656 -0.1834 0.4725 0.1596 -0.2644 -0.2518 0.0691 0.0831 0.0862 0.0913 0.0704 0.0784 0.0385 0.0951 0.0800 0.0978 0.1024 0.0977 0.0945 0.0895 0.0999 0.0923 0.0918 0.0846 0.1243 0.1216 0.0870 0.0937 0.1113 0.1028 0.1091 0.1063 0.1131 0.0604 0.0887 0.0952 0.0949 0.0879 0.0888 0.0960
va: 1.9278 2.1270 2.0108 3.8624 3.8373 3.8881 3.7866 3.7781 3.9079 3.9180 3.9111 3.9471 3.8845 3.9296 3.9084 3.7003 3.9190 3.7846 4.1724 3.8174 3.9100 3.9313 1.0205 1.0059 1.0013 1.0126 1.0123 1.0099 1.0225 1.0050 1.0154 1.0060 1.0078 0.9982 1.0065 1.0050 1.0096 1.0045 1.0029 1.0013 1.0048 0.9902 0.9805 0.9849 1.0237 0.9966 1.0372 0.9953 1.0341 1.0254 1.0069 1.0061 1.0159 1.0071 1.0056 1.0084
dispcorr: -0.023714456 hartree
energy: -970.313186845303
dipole: -18.89530 18.66409 -0.23121 9.58532 -9.88584 -0.30052 5.82501 -4.77708 1.04793
magnitude: 1.11441 au
magnitude: 2.83262 debye
