program: Orca
programVersion: 5.0.2
elementType: O O O C C C C C C C C C C C C C C C C C C C H H H H H H H H H H H H H H H H H H H H H H H H H H H H H H H H H H
charge: 0
multiplicity: 1
keywords: wb97x-d3
keywords: def2-TZVPP
keywords: def2/J RIJCOSX
keywords: DEFGRID2
keywords: scfconv7
keywords: smallprint printgap noloewdin
keywords: NOSOSCF
formula: C19H34O3
InChI: InChI=1/C19H34O3/c1-15(2)22-18(20)14-17(4)11-8-10-16(3)12-9-13-19(5,6)21-7/h8,11,14-16H,9-10,12-13H2,1-7H3
56 atoms
O  -5.595356 3.221837 0.440533
O  5.309437 -1.387933 0.533944
O  4.722387 -1.102371 -1.605232
C  -3.698901 0.983359 -0.086042
C  -3.289754 2.42651 0.184074
C  -2.627786 -0.000333 0.371385
C  -4.334348 3.497805 -0.168664
C  -2.938446 -1.46813 0.075342
C  -1.749677 -2.36726 0.446247
C  -4.628446 3.50378 -1.664273
C  -3.805861 4.871021 0.244624
C  -4.192315 -1.948744 0.796598
C  -0.521026 -2.082624 -0.348521
C  -5.650833 3.236514 1.844112
C  0.697051 -1.886856 0.167991
C  1.909998 -1.633684 -0.60789
C  1.761764 -1.494752 -2.089318
C  3.069354 -1.554219 0.081279
C  4.416362 -1.325373 -0.453435
C  6.709559 -1.193198 0.243138
C  7.34709 -0.725482 1.53453
C  7.322911 -2.48193 -0.269541
H  -3.882405 0.83606 -1.154412
H  -4.643437 0.768058 0.418654
H  -2.378818 2.657089 -0.377301
H  -3.009397 2.525175 1.238578
H  -2.46131 0.115339 1.449054
H  -1.68053 0.268057 -0.108485
H  -3.10549 -1.570679 -1.004601
H  -2.040592 -3.408573 0.262891
H  -1.538444 -2.287902 1.517238
H  -5.32035 4.307827 -1.9231
H  -5.07318 2.564884 -1.996954
H  -3.712517 3.659242 -2.235391
H  -2.914223 5.11985 -0.332083
H  -4.54574 5.652826 0.061342
H  -3.524405 4.910884 1.298359
H  -4.379348 -3.006188 0.600132
H  -5.081833 -1.402592 0.482025
H  -4.09628 -1.826765 1.878401
H  -0.659802 -2.055424 -1.426062
H  -4.94551 2.544976 2.31715
H  -6.656388 2.923287 2.128017
H  -5.482629 4.231233 2.270813
H  0.818199 -1.92465 1.247218
H  1.368759 -2.418861 -2.517794
H  1.039923 -0.710154 -2.322226
H  2.691067 -1.258923 -2.591739
H  3.023496 -1.684481 1.156559
H  6.811458 -0.410152 -0.512168
H  8.408697 -0.538529 1.371557
H  6.89885 0.203603 1.888558
H  7.258021 -1.475324 2.322646
H  8.384156 -2.327294 -0.467918
H  6.862241 -2.816103 -1.198814
H  7.234677 -3.281819 0.467754
elementType: O C H
totalener: -970.28957110 hartree
nucrepener: 1756.64040506 hartree
electener: -2726.92997616 hartree
oneelecener: -4805.69296100 hartree
twoeener: 2078.76298485 hartree
cpcmener: -0.02286491 hartree
kineticenergy: 965.59858996 hartree
xcener: -96.759399974760 hartree
chargesum: -0.0000000
charge: -0.413371 -0.293049 -0.489466 -0.137544 -0.259349 -0.183644 0.388134 0.099198 -0.123662 -0.319499 -0.335055 -0.325380 -0.146916 -0.129056 -0.142021 0.015410 -0.263902 -0.183059 0.470130 0.158880 -0.252059 -0.263008 0.075602 0.072735 0.091739 0.086613 0.068436 0.079942 0.039583 0.096086 0.080831 0.099164 0.096061 0.088866 0.098247 0.102785 0.097109 0.092374 0.093310 0.086226 0.124815 0.087280 0.121871 0.094239 0.111707 0.105294 0.102478 0.109502 0.113696 0.061112 0.088925 0.096017 0.087914 0.095068 0.093973 0.088691
qa: -0.4134 -0.2930 -0.4895 -0.1375 -0.2593 -0.1836 0.3881 0.0992 -0.1237 -0.3195 -0.3351 -0.3254 -0.1469 -0.1291 -0.1420 0.0154 -0.2639 -0.1831 0.4701 0.1589 -0.2521 -0.2630 0.0756 0.0727 0.0917 0.0866 0.0684 0.0799 0.0396 0.0961 0.0808 0.0992 0.0961 0.0889 0.0982 0.1028 0.0971 0.0924 0.0933 0.0862 0.1248 0.0873 0.1219 0.0942 0.1117 0.1053 0.1025 0.1095 0.1137 0.0611 0.0889 0.0960 0.0879 0.0951 0.0940 0.0887
va: 1.9263 2.1277 2.0106 3.8554 3.8494 3.8837 3.7813 3.7674 3.9102 3.9094 3.9169 3.9492 3.8867 3.9288 3.9045 3.7059 3.9179 3.7858 4.1738 3.8198 3.9324 3.9052 1.0105 1.0194 1.0133 1.0012 1.0135 1.0104 1.0225 1.0047 1.0149 1.0094 1.0064 1.0054 1.0061 1.0075 0.9986 1.0046 1.0017 1.0009 1.0044 0.9802 0.9901 0.9852 1.0232 0.9953 0.9971 1.0371 1.0335 1.0241 1.0057 1.0083 1.0070 1.0061 1.0175 1.0069
dispcorr: -0.023597237 hartree
energy: -970.313168333397
dipole: -19.01014 18.86140 -0.14874 8.25115 -8.39096 -0.13981 4.16753 -3.15962 1.00791
magnitude: 1.02838 au
magnitude: 2.61393 debye
