program: Orca
programVersion: 5.0.2
elementType: O O O C C C C C C C C C C C C C C C C C C C H H H H H H H H H H H H H H H H H H H H H H H H H H H H H H H H H H
charge: 0
multiplicity: 1
keywords: wb97x-d3
keywords: def2-TZVPP
keywords: def2/J RIJCOSX
keywords: DEFGRID2
keywords: scfconv7
keywords: smallprint printgap noloewdin
keywords: NOSOSCF
formula: C19H34O3
InChI: InChI=1/C19H34O3/c1-15(2)22-18(20)14-17(4)11-8-10-16(3)12-9-13-19(5,6)21-7/h8,11,14-16H,9-10,12-13H2,1-7H3
56 atoms
O  -3.467293 3.54982 -1.061316
O  4.752344 -1.347331 0.701258
O  4.297135 -1.105082 -1.474579
C  -3.635611 0.849958 0.221979
C  -3.11651 2.116649 0.894189
C  -2.831689 -0.378333 0.63357
C  -3.675807 3.438639 0.346563
C  -3.266231 -1.677536 -0.04704
C  -2.204972 -2.777048 0.135339
C  -3.035133 4.607148 1.09447
C  -5.189556 3.502338 0.513549
C  -4.617414 -2.166246 0.459752
C  -0.937856 -2.460232 -0.582045
C  -2.139884 3.59158 -1.519256
C  0.251532 -2.288116 0.004111
C  1.485585 -1.915748 -0.685074
C  1.411813 -1.707133 -2.164209
C  2.589114 -1.772192 0.080578
C  3.933353 -1.374211 -0.349775
C  6.129301 -0.956562 0.518977
C  6.244544 0.5557 0.501021
C  6.899697 -1.580058 1.663561
H  -3.581361 0.953132 -0.866284
H  -4.692639 0.709842 0.463276
H  -2.022945 2.134536 0.830985
H  -3.340405 2.077531 1.964835
H  -2.87924 -0.510815 1.721428
H  -1.779447 -0.185014 0.401366
H  -3.357076 -1.482861 -1.123399
H  -2.608156 -3.715825 -0.260824
H  -2.014929 -2.938204 1.201039
H  -1.944253 4.569452 1.073607
H  -3.335098 4.591689 2.143404
H  -3.349582 5.565764 0.675796
H  -5.696913 2.736837 -0.075541
H  -5.467049 3.356103 1.558186
H  -5.578348 4.473631 0.20062
H  -5.400073 -1.418905 0.322446
H  -4.574464 -2.405782 1.525309
H  -4.935719 -3.067583 -0.067676
H  -1.031704 -2.340763 -1.658011
H  -1.548504 2.716555 -1.228671
H  -1.599018 4.486226 -1.192319
H  -2.178437 3.611955 -2.609286
H  0.323462 -2.409423 1.081663
H  2.361601 -1.435083 -2.606507
H  1.055504 -2.614429 -2.655552
H  0.690275 -0.921522 -2.396862
H  2.489524 -1.958263 1.143948
H  6.494268 -1.36618 -0.425975
H  5.685219 1.001905 -0.321216
H  5.888157 0.989713 1.436951
H  7.289976 0.841266 0.377617
H  6.804016 -2.666539 1.665129
H  6.56271 -1.201257 2.630097
H  7.959198 -1.34285 1.563817
elementType: O C H
totalener: -970.28914620 hartree
nucrepener: 1791.35214426 hartree
electener: -2761.64129046 hartree
oneelecener: -4875.10558547 hartree
twoeener: 2113.46429501 hartree
cpcmener: -0.02252633 hartree
kineticenergy: 965.59985323 hartree
xcener: -96.759272660434 hartree
chargesum: 0.0000000
charge: -0.410724 -0.293100 -0.489481 -0.152134 -0.253323 -0.177165 0.385484 0.082231 -0.111289 -0.336366 -0.321072 -0.310867 -0.125517 -0.127729 -0.170831 0.026340 -0.267043 -0.182856 0.471962 0.158899 -0.263761 -0.252090 0.068034 0.081913 0.086373 0.092091 0.071861 0.080377 0.038672 0.093945 0.079751 0.097856 0.097437 0.102825 0.094860 0.090019 0.099400 0.089982 0.082847 0.092366 0.119906 0.087053 0.093952 0.120959 0.112647 0.109433 0.105454 0.104801 0.113387 0.061029 0.094274 0.088737 0.095327 0.096018 0.087687 0.089157
qa: -0.4107 -0.2931 -0.4895 -0.1521 -0.2533 -0.1772 0.3855 0.0822 -0.1113 -0.3364 -0.3211 -0.3109 -0.1255 -0.1277 -0.1708 0.0263 -0.2670 -0.1829 0.4720 0.1589 -0.2638 -0.2521 0.0680 0.0819 0.0864 0.0921 0.0719 0.0804 0.0387 0.0939 0.0798 0.0979 0.0974 0.1028 0.0949 0.0900 0.0994 0.0900 0.0828 0.0924 0.1199 0.0871 0.0940 0.1210 0.1126 0.1094 0.1055 0.1048 0.1134 0.0610 0.0943 0.0887 0.0953 0.0960 0.0877 0.0892
va: 1.9318 2.1281 2.0108 3.8612 3.8343 3.9002 3.7817 3.7726 3.9083 3.9185 3.9099 3.9435 3.8682 3.9290 3.9122 3.6902 3.9199 3.7835 4.1735 3.8192 3.9068 3.9325 1.0229 1.0071 1.0004 1.0130 1.0120 1.0075 1.0228 1.0056 1.0158 0.9981 1.0060 1.0080 1.0063 1.0048 1.0096 1.0044 1.0019 1.0041 1.0064 0.9806 0.9847 0.9906 1.0232 1.0369 0.9959 0.9957 1.0337 1.0241 1.0170 1.0070 1.0060 1.0085 1.0070 1.0056
dispcorr: -0.023899250 hartree
energy: -970.313045451539
dipole: -18.16997 17.84875 -0.32122 10.20634 -10.44466 -0.23831 6.28550 -5.11183 1.17367
magnitude: 1.23995 au
magnitude: 3.15170 debye
