program: Orca
programVersion: 5.0.2
elementType: O O O C C C C C C C C C C C C C C C C C C C H H H H H H H H H H H H H H H H H H H H H H H H H H H H H H H H H H
charge: 0
multiplicity: 1
keywords: wb97x-d3
keywords: def2-TZVPP
keywords: def2/J RIJCOSX
keywords: DEFGRID2
keywords: scfconv7
keywords: smallprint printgap noloewdin
keywords: NOSOSCF
formula: C19H34O3
InChI: InChI=1/C19H34O3/c1-15(2)22-18(20)14-17(4)11-8-10-16(3)12-9-13-19(5,6)21-7/h8,11,14-16H,9-10,12-13H2,1-7H3
56 atoms
O  -1.139636 2.35877 0.309111
O  4.150064 -0.627012 -0.601402
O  3.321154 0.229631 1.29065
C  -3.325987 0.336402 -0.109907
C  -3.139961 1.625467 -0.902239
C  -3.841092 -0.801071 -0.988287
C  -2.428828 2.763564 -0.154458
C  -3.927784 -2.185499 -0.329179
C  -2.582442 -2.93629 -0.318129
C  -3.182887 3.145347 1.114467
C  -2.334536 3.984688 -1.069236
C  -4.573587 -2.148168 1.051779
C  -1.474936 -2.254577 0.409886
C  -0.169972 2.041572 -0.657756
C  -0.27598 -1.994017 -0.124231
C  0.812485 -1.292173 0.550286
C  0.549146 -0.773827 1.928179
C  1.963694 -1.14213 -0.141274
C  3.176203 -0.440802 0.290495
C  5.448634 -0.046635 -0.362149
C  6.250455 -0.935331 0.569284
C  6.103505 0.104866 -1.718478
H  -4.026717 0.506368 0.711481
H  -2.378266 0.054174 0.352417
H  -4.115887 1.998495 -1.229449
H  -2.591664 1.405958 -1.825182
H  -3.211141 -0.879894 -1.881702
H  -4.837237 -0.52931 -1.353621
H  -4.580119 -2.791175 -0.967118
H  -2.272562 -3.134637 -1.347801
H  -2.754053 -3.914756 0.147092
H  -4.218396 3.399604 0.885592
H  -2.726003 4.014003 1.5934
H  -3.1930 2.333362 1.843128
H  -3.331684 4.381814 -1.26468
H  -1.747153 4.782347 -0.60932
H  -1.889469 3.75161 -2.038304
H  -3.969943 -1.614123 1.787318
H  -4.73037 -3.159121 1.433438
H  -5.549574 -1.659477 1.017905
H  -1.675697 -1.971421 1.4385
H  0.074296 2.884947 -1.312764
H  -0.44742 1.193348 -1.292927
H  0.741345 1.77242 -0.121836
H  -0.085548 -2.298964 -1.149798
H  1.418205 -0.321093 2.387777
H  -0.247766 -0.026615 1.901495
H  0.202656 -1.579322 2.577895
H  2.019867 -1.583219 -1.130134
H  5.321128 0.940897 0.087491
H  6.391349 -1.929267 0.140687
H  7.236805 -0.499848 0.733818
H  5.775821 -1.045029 1.544408
H  7.087396 0.559334 -1.600099
H  5.519225 0.750059 -2.375722
H  6.239441 -0.859739 -2.210881
elementType: O C H
totalener: -970.28522805 hartree
nucrepener: 1910.45322590 hartree
electener: -2880.73845395 hartree
oneelecener: -5113.82145811 hartree
twoeener: 2233.08300417 hartree
cpcmener: -0.02227549 hartree
kineticenergy: 965.59646745 hartree
xcener: -96.763210318645 hartree
chargesum: -0.0000000
charge: -0.406686 -0.293692 -0.493906 -0.111488 -0.258262 -0.196522 0.396686 0.080462 -0.125850 -0.325675 -0.343654 -0.323881 -0.129700 -0.125574 -0.164011 -0.003117 -0.268081 -0.187320 0.485369 0.157522 -0.263480 -0.252949 0.088668 0.029958 0.092020 0.085789 0.073702 0.087346 0.051880 0.084246 0.095840 0.090877 0.100263 0.095414 0.098852 0.103769 0.098911 0.078301 0.097234 0.097428 0.136530 0.109541 0.085958 0.105430 0.111738 0.113624 0.103405 0.112042 0.112038 0.061513 0.088929 0.095019 0.094314 0.088887 0.096116 0.088230
qa: -0.4067 -0.2937 -0.4939 -0.1115 -0.2583 -0.1965 0.3967 0.0805 -0.1259 -0.3257 -0.3437 -0.3239 -0.1297 -0.1256 -0.1640 -0.0031 -0.2681 -0.1873 0.4854 0.1575 -0.2635 -0.2529 0.0887 0.0300 0.0920 0.0858 0.0737 0.0873 0.0519 0.0842 0.0958 0.0909 0.1003 0.0954 0.0989 0.1038 0.0989 0.0783 0.0972 0.0974 0.1365 0.1095 0.0860 0.1054 0.1117 0.1136 0.1034 0.1120 0.1120 0.0615 0.0889 0.0950 0.0943 0.0889 0.0961 0.0882
va: 1.9331 2.1342 1.9943 3.8222 3.8497 3.9528 3.7561 3.7880 3.9258 3.9216 3.9205 3.9610 3.8619 3.9265 3.8727 3.6926 3.8970 3.7724 4.1364 3.8198 3.9076 3.9336 1.0027 1.0309 1.0135 1.0029 1.0093 1.0038 1.0126 1.0143 1.0045 1.0047 1.0094 1.0038 1.0058 1.0084 0.9973 0.9961 1.0057 1.0015 0.9885 0.9893 0.9779 0.9997 1.0231 1.0361 1.0066 0.9976 1.0351 1.0241 1.0070 1.0064 1.0169 1.0058 1.0081 1.0069
dispcorr: -0.028494553 hartree
energy: -970.313722602903
dipole: -15.54748 14.58520 -0.96228 4.55958 -5.17240 -0.61282 -3.05089 1.77889 -1.27200
magnitude: 1.70866 au
magnitude: 4.34307 debye
