program: Orca
programVersion: 5.0.2
elementType: O O O C C C C C C C C C C C C C C C C C C C H H H H H H H H H H H H H H H H H H H H H H H H H H H H H H H H H H
charge: 0
multiplicity: 1
keywords: wb97x-d3
keywords: def2-TZVPP
keywords: def2/J RIJCOSX
keywords: DEFGRID2
keywords: scfconv7
keywords: smallprint printgap noloewdin
keywords: NOSOSCF
formula: C19H34O3
InChI: InChI=1/C19H34O3/c1-15(2)22-18(20)14-17(4)11-8-10-16(3)12-9-13-19(5,6)21-7/h8,11,14-16H,9-10,12-13H2,1-7H3
56 atoms
O  -2.517966 3.213787 0.869747
O  4.144557 -0.76478 0.409067
O  3.50904 -0.343069 -1.692591
C  -2.928163 0.301054 1.163731
C  -2.772858 1.1030 -0.123509
C  -4.063285 -0.717886 1.114239
C  -1.858107 2.331317 -0.037242
C  -3.994072 -1.814532 0.04788
C  -2.724045 -2.680932 0.151144
C  -1.752684 2.963819 -1.424933
C  -0.465263 1.948244 0.458615
C  -5.236354 -2.694159 0.156131
C  -1.544719 -2.137312 -0.580889
C  -1.852289 4.396811 1.22889
C  -0.32276 -1.967335 -0.065238
C  0.82738 -1.441413 -0.794862
C  0.627849 -1.085313 -2.23382
C  1.977334 -1.296907 -0.100518
C  3.251899 -0.754538 -0.581369
C  5.462723 -0.226306 0.184237
C  5.438593 1.282537 0.337576
C  6.369263 -0.896339 1.19443
H  -3.136018 0.980855 1.994261
H  -1.990003 -0.198969 1.415129
H  -3.760402 1.440658 -0.460325
H  -2.391342 0.457073 -0.919243
H  -5.006733 -0.176726 0.980652
H  -4.136323 -1.203671 2.094119
H  -4.007597 -1.347836 -0.944256
H  -2.946877 -3.658833 -0.293168
H  -2.476921 -2.872238 1.200021
H  -1.302991 2.260939 -2.128238
H  -1.128742 3.859467 -1.430735
H  -2.737046 3.236128 -1.812029
H  0.230372 2.789035 0.423712
H  -0.480095 1.571339 1.482627
H  -0.044967 1.16556 -0.17437
H  -5.262645 -3.227616 1.109843
H  -5.2682 -3.440947 -0.639538
H  -6.150685 -2.101551 0.087387
H  -1.725553 -1.894583 -1.624465
H  -2.533584 4.966769 1.862795
H  -1.594469 5.029264 0.372468
H  -0.937295 4.220888 1.804851
H  -0.156846 -2.213749 0.979997
H  1.523255 -0.703074 -2.707277
H  0.292016 -1.958515 -2.796409
H  -0.156169 -0.330579 -2.330218
H  1.976797 -1.595281 0.941881
H  5.790688 -0.48993 -0.824176
H  5.112519 1.570664 1.338772
H  6.440858 1.684251 0.183665
H  4.780668 1.75947 -0.389107
H  7.39253 -0.545667 1.059091
H  6.372805 -1.980204 1.071115
H  6.070558 -0.666532 2.218928
elementType: O C H
totalener: -970.28471079 hartree
nucrepener: 1898.97395420 hartree
electener: -2869.25866499 hartree
oneelecener: -5090.44109808 hartree
twoeener: 2221.18243309 hartree
cpcmener: -0.02234373 hartree
kineticenergy: 965.59860948 hartree
xcener: -96.762632582751 hartree
chargesum: 0.0000000
charge: -0.394571 -0.292622 -0.490013 -0.100468 -0.187191 -0.230638 0.350354 0.090467 -0.133454 -0.329553 -0.364470 -0.305408 -0.118133 -0.123035 -0.172978 -0.004710 -0.248312 -0.181897 0.481207 0.157476 -0.264431 -0.251744 0.083278 0.069773 0.087248 0.069420 0.076162 0.078961 0.047773 0.096397 0.085949 0.095520 0.099205 0.098991 0.110395 0.107379 0.072314 0.087159 0.088399 0.088629 0.124001 0.116097 0.087699 0.090297 0.115630 0.111578 0.113830 0.086650 0.112125 0.061336 0.088791 0.095809 0.094665 0.089009 0.095898 0.087759
qa: -0.3946 -0.2926 -0.4900 -0.1005 -0.1872 -0.2306 0.3504 0.0905 -0.1335 -0.3296 -0.3645 -0.3054 -0.1181 -0.1230 -0.1730 -0.0047 -0.2483 -0.1819 0.4812 0.1575 -0.2644 -0.2517 0.0833 0.0698 0.0872 0.0694 0.0762 0.0790 0.0478 0.0964 0.0859 0.0955 0.0992 0.0990 0.1104 0.1074 0.0723 0.0872 0.0884 0.0886 0.1240 0.1161 0.0877 0.0903 0.1156 0.1116 0.1138 0.0867 0.1121 0.0613 0.0888 0.0958 0.0947 0.0890 0.0959 0.0878
va: 1.9596 2.1281 2.0102 3.8059 3.7560 3.9568 3.8514 3.7019 3.9080 3.9266 3.9369 3.9367 3.8430 3.9320 3.8719 3.6715 3.8982 3.7595 4.1649 3.8195 3.9078 3.9327 1.0349 1.0090 1.0284 1.0107 1.0084 1.0088 1.0190 1.0017 1.0132 1.0002 1.0038 1.0092 1.0030 0.9973 1.0187 1.0010 1.0042 1.0049 1.0009 0.9925 0.9830 0.9819 1.0213 1.0389 0.9973 0.9982 1.0350 1.0241 1.0069 1.0060 1.0166 1.0057 1.0083 1.0071
dispcorr: -0.027991230 hartree
energy: -970.312702019976
dipole: -12.64620 12.50545 -0.14075 6.07794 -6.33823 -0.26029 3.18491 -2.77904 0.40587
magnitude: 0.50228 au
magnitude: 1.27671 debye
