program: Orca
programVersion: 5.0.2
elementType: O O O C C C C C C C C C C C C C C C C C C C H H H H H H H H H H H H H H H H H H H H H H H H H H H H H H H H H H
charge: 0
multiplicity: 1
keywords: wb97x-d3
keywords: def2-TZVPP
keywords: def2/J RIJCOSX
keywords: DEFGRID2
keywords: scfconv7
keywords: smallprint printgap noloewdin
keywords: NOSOSCF
formula: C19H34O3
InChI: InChI=1/C19H34O3/c1-15(2)22-18(20)14-17(4)11-8-10-16(3)12-9-13-19(5,6)21-7/h8,11,14-16H,9-10,12-13H2,1-7H3
56 atoms
O  -5.885862 3.366294 -0.704901
O  5.719811 -1.745859 0.589959
O  5.128159 -2.818309 -1.28417
C  -3.734051 1.638335 0.181178
C  -4.953058 2.054376 0.996083
C  -3.237564 0.250363 0.571388
C  -5.532371 3.436033 0.668184
C  -1.998855 -0.215515 -0.196703
C  -1.394285 -1.451062 0.492749
C  -4.504071 4.536066 0.943739
C  -6.772122 3.667937 1.535572
C  -2.310468 -0.484783 -1.665062
C  -0.168212 -1.970921 -0.182762
C  -6.288497 4.548267 -1.33271
C  1.075339 -1.765644 0.258849
C  2.298323 -2.222345 -0.397666
C  2.153525 -3.015129 -1.659605
C  3.466975 -1.890248 0.185072
C  4.822463 -2.220153 -0.28231
C  7.113835 -1.953844 0.32413
C  7.631168 -0.894636 -0.633745
C  7.814422 -1.910479 1.667948
H  -2.917927 2.353115 0.326294
H  -3.987432 1.670054 -0.879439
H  -4.70462 2.033503 2.062316
H  -5.744499 1.310439 0.855618
H  -4.041624 -0.482619 0.432925
H  -3.01204 0.247265 1.643941
H  -1.24603 0.580621 -0.147867
H  -2.154245 -2.240275 0.525896
H  -1.163031 -1.197161 1.530842
H  -4.939701 5.53403 0.873154
H  -3.662936 4.490135 0.251481
H  -4.10725 4.434473 1.95459
H  -6.511593 3.630744 2.594149
H  -7.228386 4.642785 1.355481
H  -7.526507 2.902595 1.348627
H  -2.765587 0.380524 -2.145836
H  -3.005716 -1.321721 -1.769722
H  -1.411737 -0.725732 -2.233569
H  -0.32123 -2.529705 -1.100287
H  -5.488052 5.293479 -1.402999
H  -7.150572 5.027061 -0.852754
H  -6.583714 4.284424 -2.348218
H  1.209733 -1.207868 1.18179
H  1.53963 -3.899219 -1.477996
H  1.638912 -2.421702 -2.417957
H  3.10547 -3.33411 -2.064649
H  3.432094 -1.316615 1.104049
H  7.248753 -2.941402 -0.124488
H  8.69874 -1.037024 -0.804977
H  7.132336 -0.949771 -1.599901
H  7.488913 0.106208 -0.223229
H  7.697511 -0.937795 2.147724
H  8.881113 -2.092092 1.536501
H  7.427407 -2.673325 2.343232
totalener: -970.26876170 hartree
nucrepener: 1718.81735580 hartree
electener: -2689.08611751 hartree
oneelecener: -4729.70722433 hartree
twoeener: 2040.62110683 hartree
kineticenergy: 965.64054597 hartree
xcener: -96.760932014571 hartree
chargesum: -0.0000000
charge: -0.334843 -0.273900 -0.404700 -0.109394 -0.152936 -0.188337 0.307744 0.124588 -0.148771 -0.365631 -0.301208 -0.313118 -0.128730 -0.120965 -0.083227 0.032209 -0.267967 -0.163168 0.412633 0.142102 -0.259009 -0.228211 0.055736 0.079101 0.061960 0.075289 0.066845 0.065894 0.039173 0.087892 0.069191 0.096277 0.101388 0.094865 0.084554 0.082644 0.096371 0.090551 0.081022 0.087448 0.102621 0.080983 0.075211 0.109737 0.071943 0.090037 0.088967 0.124325 0.093048 0.059318 0.079722 0.103690 0.081686 0.080594 0.075902 0.090851
qa: -0.3348 -0.2739 -0.4047 -0.1094 -0.1529 -0.1883 0.3077 0.1246 -0.1488 -0.3656 -0.3012 -0.3131 -0.1287 -0.1210 -0.0832 0.0322 -0.2680 -0.1632 0.4126 0.1421 -0.2590 -0.2282 0.0557 0.0791 0.0620 0.0753 0.0668 0.0659 0.0392 0.0879 0.0692 0.0963 0.1014 0.0949 0.0846 0.0826 0.0964 0.0906 0.0810 0.0874 0.1026 0.0810 0.0752 0.1097 0.0719 0.0900 0.0890 0.1243 0.0930 0.0593 0.0797 0.1037 0.0817 0.0806 0.0759 0.0909
va: 2.0078 2.1346 2.0937 3.8440 3.8182 3.9350 3.8728 3.7555 3.9615 3.9398 3.9264 3.9645 3.8960 3.9577 3.9477 3.6850 3.9242 3.8201 4.2229 3.8580 3.9104 3.9268 1.0108 1.0413 1.0186 1.0227 1.0125 1.0114 1.0248 1.0077 1.0203 0.9999 0.9987 1.0073 1.0086 1.0083 1.0122 1.0109 1.0023 1.0037 1.0028 0.9807 0.9837 0.9966 1.0312 0.9973 0.9985 1.0399 1.0375 1.0249 1.0092 1.0168 1.0084 1.0096 1.0080 1.0113
dispcorr: -0.023009809 hartree
energy: -970.291771512181
dipole: -22.68430 22.12659 -0.55770 16.48299 -15.66354 0.81945 2.52549 -1.87931 0.64619
magnitude: 1.18325 au
magnitude: 3.00759 debye
