program: Orca
programVersion: 5.0.2
elementType: O O O C C C C C C C C C C C C C C C C C C C H H H H H H H H H H H H H H H H H H H H H H H H H H H H H H H H H H
charge: 0
multiplicity: 1
keywords: wb97x-d3
keywords: def2-TZVPP
keywords: def2/J RIJCOSX
keywords: DEFGRID2
keywords: scfconv7
keywords: smallprint printgap noloewdin
keywords: NOSOSCF
formula: C19H34O3
InChI: InChI=1/C19H34O3/c1-15(2)22-18(20)14-17(4)11-8-10-16(3)12-9-13-19(5,6)21-7/h8,11,14-16H,9-10,12-13H2,1-7H3
56 atoms
O  -5.685661 2.987767 -0.359367
O  5.29017 -1.682007 -0.588225
O  4.84974 -1.013816 1.502732
C  -3.475861 1.092591 -0.397849
C  -3.67618 2.243306 0.581292
C  -2.828645 -0.114581 0.273075
C  -4.407964 3.471118 0.026047
C  -2.464367 -1.247558 -0.686804
C  -1.74687 -2.401878 0.035596
C  -3.645269 4.068235 -1.159094
C  -4.529383 4.514791 1.138789
C  -3.682931 -1.790193 -1.426057
C  -0.490208 -1.990025 0.731854
C  -6.570181 3.890093 -0.957122
C  0.725207 -2.109484 0.19176
C  1.980333 -1.683626 0.805399
C  1.921176 -1.127187 2.193547
C  3.098517 -1.82036 0.066336
C  4.47193 -1.455046 0.445845
C  6.685617 -1.384057 -0.441282
C  7.398213 -2.515724 0.278296
C  7.221938 -1.167303 -1.842715
H  -2.842252 1.413064 -1.231387
H  -4.440003 0.817302 -0.827426
H  -2.703081 2.568942 0.96301
H  -4.235827 1.879217 1.449539
H  -3.497644 -0.502404 1.051215
H  -1.923467 0.220396 0.790645
H  -1.761676 -0.847154 -1.427739
H  -1.51771 -3.180262 -0.697339
H  -2.438059 -2.849158 0.758025
H  -3.656941 3.403286 -2.02309
H  -2.603467 4.243432 -0.887402
H  -4.057017 5.028857 -1.472651
H  -3.542192 4.795336 1.507834
H  -5.012414 5.432102 0.798534
H  -5.102492 4.122377 1.98005
H  -3.410534 -2.622231 -2.077523
H  -4.154246 -1.032388 -2.050988
H  -4.436884 -2.154585 -0.724208
H  -0.59798 -1.546236 1.715912
H  -6.825717 4.74028 -0.314206
H  -7.491355 3.343953 -1.159902
H  -6.203712 4.288371 -1.910266
H  0.807087 -2.553198 -0.797071
H  1.290285 -0.236226 2.214625
H  1.466786 -1.853945 2.869172
H  2.897542 -0.862907 2.57911
H  3.001021 -2.234081 -0.930669
H  6.793865 -0.463631 0.1387
H  7.290629 -3.454309 -0.267373
H  8.463272 -2.293631 0.354292
H  7.017189 -2.653219 1.288719
H  8.280717 -0.91188 -1.799646
H  6.702331 -0.35241 -2.346596
H  7.119317 -2.066796 -2.451006
totalener: -970.26856415 hartree
nucrepener: 1749.90296504 hartree
electener: -2720.17152919 hartree
oneelecener: -4791.89260561 hartree
twoeener: 2071.72107642 hartree
kineticenergy: 965.64838822 hartree
xcener: -96.762407075181 hartree
chargesum: 0.0000000
charge: -0.332758 -0.273463 -0.404494 -0.117123 -0.155871 -0.184397 0.318668 0.103593 -0.162240 -0.366172 -0.312910 -0.294359 -0.118765 -0.122886 -0.089296 0.030289 -0.267243 -0.161162 0.411499 0.142923 -0.259835 -0.229270 0.060935 0.082267 0.061957 0.074960 0.068594 0.067013 0.040139 0.077791 0.088032 0.103093 0.094535 0.092583 0.085702 0.083671 0.099878 0.082337 0.088909 0.081733 0.103954 0.076767 0.109707 0.078789 0.073272 0.086153 0.092143 0.124258 0.093244 0.059183 0.081450 0.080002 0.104625 0.076041 0.090233 0.081321
qa: -0.3328 -0.2735 -0.4045 -0.1171 -0.1559 -0.1844 0.3187 0.1036 -0.1622 -0.3662 -0.3129 -0.2944 -0.1188 -0.1229 -0.0893 0.0303 -0.2672 -0.1612 0.4115 0.1429 -0.2598 -0.2293 0.0609 0.0823 0.0620 0.0750 0.0686 0.0670 0.0401 0.0778 0.0880 0.1031 0.0945 0.0926 0.0857 0.0837 0.0999 0.0823 0.0889 0.0817 0.1040 0.0768 0.1097 0.0788 0.0733 0.0862 0.0921 0.1243 0.0932 0.0592 0.0815 0.0800 0.1046 0.0760 0.0902 0.0813
va: 2.0126 2.1346 2.0940 3.8611 3.8224 3.9166 3.8617 3.7840 3.9438 3.9429 3.9233 3.9578 3.8849 3.9605 3.9368 3.6795 3.9228 3.8199 4.2247 3.8576 3.9075 3.9271 1.0075 1.0367 1.0189 1.0230 1.0109 1.0121 1.0230 1.0176 1.0102 0.9995 1.0065 1.0016 1.0093 1.0062 1.0107 1.0078 1.0051 1.0029 1.0007 0.9829 0.9961 0.9809 1.0309 0.9980 0.9979 1.0397 1.0376 1.0240 1.0086 1.0090 1.0175 1.0081 1.0113 1.0096
dispcorr: -0.023246216 hartree
energy: -970.291810368309
dipole: -20.09934 19.66937 -0.42997 11.11236 -10.77338 0.33898 -4.84861 4.26478 -0.58384
magnitude: 0.80040 au
magnitude: 2.03446 debye
