program: Orca
programVersion: 5.0.2
elementType: O O O C C C C C C C C C C C C C C C C C C C H H H H H H H H H H H H H H H H H H H H H H H H H H H H H H H H H H
charge: 0
multiplicity: 1
keywords: wb97x-d3
keywords: def2-TZVPP
keywords: def2/J RIJCOSX
keywords: DEFGRID2
keywords: scfconv7
keywords: smallprint printgap noloewdin
keywords: NOSOSCF
formula: C19H34O3
InChI: InChI=1/C19H34O3/c1-15(2)22-18(20)14-17(4)11-8-10-16(3)12-9-13-19(5,6)21-7/h8,11,14-16H,9-10,12-13H2,1-7H3
56 atoms
O  -6.286992 2.952291 -0.487519
O  5.813057 -1.784093 0.541913
O  5.169536 -2.888049 -1.297048
C  -3.72261 1.717374 0.170777
C  -4.769903 2.246025 1.144243
C  -3.083152 0.431884 0.683302
C  -5.595661 3.440156 0.652084
C  -1.911859 -0.086315 -0.152626
C  -1.280397 -1.295922 0.557926
C  -4.689633 4.623082 0.304736
C  -6.57612 3.846376 1.75433
C  -2.327715 -0.424487 -1.579556
C  -0.08521 -1.851686 -0.141819
C  -7.067821 3.854505 -1.214222
C  1.171838 -1.674316 0.271713
C  2.369257 -2.174792 -0.399124
C  2.181597 -2.970965 -1.652902
C  3.554314 -1.876696 0.16797
C  4.893684 -2.255116 -0.308082
C  7.198364 -2.037683 0.270599
C  7.734434 -1.025389 -0.726717
C  7.911275 -1.964776 1.606632
H  -2.939189 2.46589 0.013475
H  -4.18982 1.546268 -0.800273
H  -4.284058 2.526573 2.084358
H  -5.465804 1.43731 1.39292
H  -3.849455 -0.349839 0.750921
H  -2.731994 0.59524 1.708757
H  -1.148719 0.70024 -0.195545
H  -2.041213 -2.079261 0.653796
H  -1.006151 -1.003572 1.575295
H  -4.06741 4.41271 -0.56582
H  -4.026268 4.848984 1.140727
H  -5.258201 5.530972 0.096749
H  -7.1940 4.69951 1.469552
H  -7.240173 3.019068 2.009237
H  -6.037054 4.134176 2.657714
H  -1.479585 -0.750124 -2.182477
H  -2.762918 0.435167 -2.087707
H  -3.072703 -1.224412 -1.590111
H  -0.273167 -2.418033 -1.048101
H  -6.482583 4.655229 -1.680937
H  -7.861069 4.321927 -0.619084
H  -7.547639 3.28809 -2.012237
H  1.338938 -1.108347 1.184294
H  1.558153 -3.844397 -1.45153
H  1.657591 -2.373193 -2.401383
H  3.118206 -3.308335 -2.078558
H  3.546829 -1.293456 1.081591
H  7.302897 -3.043542 -0.144662
H  7.616385 -0.00764 -0.35137
H  8.797877 -1.197676 -0.896312
H  7.230114 -1.103904 -1.68843
H  7.821543 -0.97295 2.051945
H  8.972151 -2.176913 1.474188
H  7.511066 -2.693248 2.311573
totalener: -970.26900677 hartree
nucrepener: 1716.09391790 hartree
electener: -2686.36292468 hartree
oneelecener: -4724.25933782 hartree
twoeener: 2037.89641315 hartree
kineticenergy: 965.65131961 hartree
xcener: -96.762967958605 hartree
chargesum: -0.0000000
charge: -0.332758 -0.273089 -0.404360 -0.105076 -0.158756 -0.197692 0.312648 0.135433 -0.151463 -0.365895 -0.307395 -0.316559 -0.131544 -0.123802 -0.081538 0.031303 -0.267547 -0.161782 0.411510 0.141282 -0.259219 -0.228696 0.059591 0.079192 0.063258 0.075606 0.067389 0.066437 0.040407 0.087674 0.069937 0.103011 0.093647 0.094213 0.083637 0.098597 0.084663 0.085957 0.090117 0.083977 0.101342 0.080419 0.076429 0.110151 0.071276 0.090192 0.088410 0.123773 0.092956 0.059758 0.081863 0.079594 0.104067 0.080763 0.075847 0.090846
qa: -0.3328 -0.2731 -0.4044 -0.1051 -0.1588 -0.1977 0.3126 0.1354 -0.1515 -0.3659 -0.3074 -0.3166 -0.1315 -0.1238 -0.0815 0.0313 -0.2675 -0.1618 0.4115 0.1413 -0.2592 -0.2287 0.0596 0.0792 0.0633 0.0756 0.0674 0.0664 0.0404 0.0877 0.0699 0.1030 0.0936 0.0942 0.0836 0.0986 0.0847 0.0860 0.0901 0.0840 0.1013 0.0804 0.0764 0.1102 0.0713 0.0902 0.0884 0.1238 0.0930 0.0598 0.0819 0.0796 0.1041 0.0808 0.0758 0.0908
va: 2.0119 2.1347 2.0945 3.8356 3.8231 3.9410 3.8705 3.7460 3.9658 3.9430 3.9245 3.9681 3.8952 3.9593 3.9518 3.6845 3.9250 3.8177 4.2253 3.8588 3.9086 3.9275 1.0081 1.0388 1.0180 1.0240 1.0119 1.0110 1.0252 1.0080 1.0205 0.9988 1.0067 1.0016 1.0070 1.0110 1.0093 1.0050 1.0082 1.0014 1.0033 0.9810 0.9836 0.9960 1.0315 0.9974 0.9983 1.0400 1.0376 1.0245 1.0084 1.0092 1.0169 1.0095 1.0081 1.0113
dispcorr: -0.022990108 hartree
energy: -970.291996879153
dipole: -23.03296 22.47385 -0.55911 16.90519 -16.02430 0.88089 1.83985 -1.29422 0.54563
magnitude: 1.17740 au
magnitude: 2.99272 debye
