program: Orca
programVersion: 5.0.2
elementType: O O O C C C C C C C C C C C C C C C C C C C H H H H H H H H H H H H H H H H H H H H H H H H H H H H H H H H H H
charge: 0
multiplicity: 1
keywords: wb97x-d3
keywords: def2-TZVPP
keywords: def2/J RIJCOSX
keywords: DEFGRID2
keywords: scfconv7
keywords: smallprint printgap noloewdin
keywords: NOSOSCF
formula: C19H34O3
InChI: InChI=1/C19H34O3/c1-15(2)22-18(20)14-17(4)11-8-10-16(3)12-9-13-19(5,6)21-7/h8,11,14-16H,9-10,12-13H2,1-7H3
56 atoms
O  -6.873556 3.877742 0.185083
O  6.194779 -1.762917 0.113629
O  4.980717 -3.576788 -0.385215
C  -4.002925 1.482275 0.189561
C  -4.891249 2.700185 -0.038745
C  -2.606559 1.682819 -0.389786
C  -6.353326 2.573186 0.412146
C  -1.671831 0.482118 -0.231361
C  -0.390965 0.705119 -1.049599
C  -6.438983 2.215523 1.89666
C  -7.086327 1.524368 -0.424834
C  -1.338956 0.197867 1.228872
C  0.514295 -0.479966 -1.062034
C  -8.252158 4.068008 0.313418
C  1.791603 -0.468067 -0.673774
C  2.694783 -1.617039 -0.678914
C  2.137831 -2.93309 -1.124059
C  3.965332 -1.400489 -0.28632
C  5.054673 -2.386816 -0.203993
C  7.395612 -2.539881 0.230294
C  8.544788 -1.593063 -0.056266
C  7.487753 -3.162543 1.612198
H  -4.445035 0.591924 -0.268583
H  -3.931601 1.273204 1.259317
H  -4.888845 2.955578 -1.103564
H  -4.454051 3.559307 0.479928
H  -2.141845 2.56301 0.069682
H  -2.703284 1.917302 -1.455478
H  -2.181699 -0.397397 -0.646234
H  0.140801 1.582263 -0.667594
H  -0.67659 0.940664 -2.081395
H  -7.470704 2.195656 2.251146
H  -5.88854 2.93517 2.504446
H  -6.025825 1.225326 2.088073
H  -7.078744 1.790667 -1.483318
H  -6.613754 0.547875 -0.323448
H  -8.124945 1.400193 -0.114332
H  -0.677524 -0.662826 1.329849
H  -2.232052 -0.008413 1.818065
H  -0.832358 1.05275 1.683515
H  0.069932 -1.404936 -1.419498
H  -8.83257 3.565572 -0.46895
H  -8.433724 5.138796 0.221675
H  -8.652025 3.74887 1.283293
H  2.214906 0.468727 -0.322266
H  2.871175 -3.728633 -1.095443
H  1.296418 -3.218035 -0.48981
H  1.754213 -2.851491 -2.142801
H  4.245311 -0.392296 -0.003842
H  7.381122 -3.333197 -0.521638
H  9.490928 -2.132055 -0.007764
H  8.460781 -1.155664 -1.050862
H  8.584092 -0.781785 0.671846
H  6.66725 -3.854294 1.79544
H  7.479269 -2.39561 2.388054
H  8.419241 -3.721979 1.7057
totalener: -970.26880761 hartree
nucrepener: 1704.44335039 hartree
electener: -2674.71215799 hartree
oneelecener: -4700.78544433 hartree
twoeener: 2026.07328634 hartree
kineticenergy: 965.64263064 hartree
xcener: -96.761918617432 hartree
chargesum: -0.0000000
charge: -0.319376 -0.273995 -0.404482 -0.145434 -0.134828 -0.184741 0.310236 0.095734 -0.111196 -0.335291 -0.348621 -0.303686 -0.156655 -0.124327 -0.073201 0.032922 -0.267567 -0.162205 0.413943 0.142375 -0.227531 -0.259362 0.064027 0.070376 0.072971 0.080166 0.069493 0.067497 0.034096 0.069687 0.088527 0.087555 0.102223 0.081503 0.103484 0.088278 0.090172 0.097540 0.088375 0.077716 0.098413 0.081221 0.110326 0.073753 0.071947 0.124283 0.088710 0.089460 0.093389 0.059217 0.075719 0.090461 0.081029 0.103886 0.081754 0.080035
qa: -0.3194 -0.2740 -0.4045 -0.1454 -0.1348 -0.1847 0.3102 0.0957 -0.1112 -0.3353 -0.3486 -0.3037 -0.1567 -0.1243 -0.0732 0.0329 -0.2676 -0.1622 0.4139 0.1424 -0.2275 -0.2594 0.0640 0.0704 0.0730 0.0802 0.0695 0.0675 0.0341 0.0697 0.0885 0.0876 0.1022 0.0815 0.1035 0.0883 0.0902 0.0975 0.0884 0.0777 0.0984 0.0812 0.1103 0.0738 0.0719 0.1243 0.0887 0.0895 0.0934 0.0592 0.0757 0.0905 0.0810 0.1039 0.0818 0.0800
va: 2.0303 2.1342 2.0933 3.8585 3.8075 3.9419 3.9069 3.7572 3.9322 3.9444 3.9311 3.9520 3.9103 3.9595 3.9541 3.6885 3.9227 3.8231 4.2219 3.8577 3.9262 3.9113 1.0090 1.0048 1.0265 1.0273 1.0131 1.0158 1.0218 1.0188 1.0079 1.0098 1.0085 1.0030 1.0053 1.0090 1.0012 1.0063 1.0054 1.0066 1.0106 0.9808 0.9967 0.9826 1.0315 1.0400 0.9985 0.9970 1.0374 1.0251 1.0081 1.0113 1.0096 1.0165 1.0086 1.0090
dispcorr: -0.023094507 hartree
energy: -970.291902113908
dipole: -25.46457 24.90522 -0.55936 8.94256 -8.66604 0.27652 5.46634 -5.33458 0.13176
magnitude: 0.63773 au
magnitude: 1.62099 debye
