program: Orca
programVersion: 5.0.2
elementType: O O O C C C C C C C C C C C C C C C C C C C H H H H H H H H H H H H H H H H H H H H H H H H H H H H H H H H H H
charge: 0
multiplicity: 1
keywords: wb97x-d3
keywords: def2-TZVPP
keywords: def2/J RIJCOSX
keywords: DEFGRID2
keywords: scfconv7
keywords: smallprint printgap noloewdin
keywords: NOSOSCF
formula: C19H34O3
InChI: InChI=1/C19H34O3/c1-15(2)22-18(20)14-17(4)11-8-10-16(3)12-9-13-19(5,6)21-7/h8,11,14-16H,9-10,12-13H2,1-7H3
56 atoms
O  -2.836364 3.300745 -0.836569
O  4.593465 -0.484001 0.20246
O  4.205942 -2.687781 0.272594
C  -2.558855 0.95005 1.00582
C  -3.802391 1.819396 0.848634
C  -2.873797 -0.539993 1.121705
C  -3.536954 3.265459 0.400071
C  -3.374792 -1.213642 -0.158742
C  -2.337142 -1.164689 -1.297223
C  -2.612882 3.980473 1.380186
C  -4.864465 4.021843 0.31761
C  -3.821412 -2.64335 0.132818
C  -1.0628 -1.871932 -0.975708
C  -3.493618 2.815107 -1.970093
C  0.11079 -1.263063 -0.786785
C  1.365893 -1.925877 -0.438276
C  1.343039 -3.415006 -0.285546
C  2.447394 -1.140362 -0.269312
C  3.810311 -1.562871 0.091055
C  5.972349 -0.668524 0.554131
C  6.788682 -1.017068 -0.67856
C  6.424701 0.627081 1.19889
H  -2.015154 1.255691 1.903162
H  -1.871572 1.128609 0.175474
H  -4.342456 1.850383 1.800465
H  -4.500841 1.353633 0.145834
H  -3.623545 -0.684339 1.907505
H  -1.978886 -1.068412 1.46385
H  -4.253008 -0.668367 -0.522649
H  -2.126489 -0.126438 -1.564021
H  -2.786847 -1.621568 -2.185262
H  -1.622422 3.526543 1.400724
H  -3.021664 3.94725 2.390715
H  -2.490499 5.027748 1.100885
H  -5.299872 4.126156 1.31197
H  -4.719043 5.024452 -0.088019
H  -5.603204 3.508674 -0.300491
H  -4.647812 -2.654517 0.844577
H  -3.016596 -3.238744 0.568263
H  -4.159967 -3.1527 -0.771173
H  -1.123981 -2.951255 -0.87843
H  -2.789573 2.885091 -2.799366
H  -4.381484 3.398321 -2.239631
H  -3.798572 1.764624 -1.884586
H  0.155285 -0.182112 -0.889838
H  1.005933 -3.882224 -1.212681
H  2.311578 -3.823988 -0.027827
H  0.630176 -3.699896 0.490816
H  2.325193 -0.071827 -0.403736
H  6.049318 -1.483286 1.278763
H  6.714969 -0.230811 -1.431444
H  7.84006 -1.124508 -0.409425
H  6.464336 -1.956975 -1.12202
H  6.355345 1.463827 0.502478
H  7.464349 0.540705 1.514892
H  5.827117 0.864465 2.078805
totalener: -970.26701111 hartree
nucrepener: 1828.83173958 hartree
electener: -2799.09875069 hartree
oneelecener: -4949.64283174 hartree
twoeener: 2150.54408106 hartree
kineticenergy: 965.64338570 hartree
xcener: -96.765460594774 hartree
chargesum: -0.0000000
charge: -0.340798 -0.273118 -0.404838 -0.114447 -0.283092 -0.205568 0.364883 0.089760 -0.136746 -0.286423 -0.322301 -0.305173 -0.153220 -0.133458 -0.084836 0.031159 -0.271472 -0.154067 0.410493 0.142330 -0.258961 -0.228691 0.083618 0.068113 0.081820 0.082344 0.076806 0.093246 0.045057 0.073407 0.096629 0.094013 0.076134 0.092402 0.088045 0.103866 0.086652 0.088204 0.078131 0.090486 0.101103 0.117842 0.089124 0.063409 0.075877 0.091110 0.125449 0.087878 0.095526 0.059093 0.081836 0.079739 0.103746 0.081683 0.075949 0.090248
qa: -0.3408 -0.2731 -0.4048 -0.1144 -0.2831 -0.2056 0.3649 0.0898 -0.1367 -0.2864 -0.3223 -0.3052 -0.1532 -0.1335 -0.0848 0.0312 -0.2715 -0.1541 0.4105 0.1423 -0.2590 -0.2287 0.0836 0.0681 0.0818 0.0823 0.0768 0.0932 0.0451 0.0734 0.0966 0.0940 0.0761 0.0924 0.0880 0.1039 0.0867 0.0882 0.0781 0.0905 0.1011 0.1178 0.0891 0.0634 0.0759 0.0911 0.1254 0.0879 0.0955 0.0591 0.0818 0.0797 0.1037 0.0817 0.0759 0.0902
va: 1.9990 2.1356 2.0932 3.8354 3.8942 3.9429 3.8156 3.7424 3.9487 3.9219 3.9249 3.9645 3.9000 3.9613 3.9345 3.6839 3.9217 3.8178 4.2263 3.8574 3.9096 3.9275 1.0097 1.0373 1.0201 1.0020 1.0086 1.0057 1.0155 1.0142 1.0067 1.0090 1.0068 1.0141 1.0103 1.0081 1.0004 1.0080 1.0010 1.0043 1.0033 0.9925 0.9860 0.9751 1.0290 0.9973 1.0400 0.9978 1.0370 1.0250 1.0085 1.0091 1.0169 1.0095 1.0081 1.0114
dispcorr: -0.025912771 hartree
energy: -970.292923881245
dipole: -19.76768 18.83550 -0.93218 8.50694 -8.11437 0.39257 2.14702 -2.14864 -0.00161
magnitude: 1.01148 au
magnitude: 2.57097 debye
