program: Orca
programVersion: 5.0.2
elementType: O O O C C C C C C C C C C C C C C C C C C C H H H H H H H H H H H H H H H H H H H H H H H H H H H H H H H H H H
charge: 0
multiplicity: 1
keywords: wb97x-d3
keywords: def2-TZVPP
keywords: def2/J RIJCOSX
keywords: DEFGRID2
keywords: scfconv7
keywords: smallprint printgap noloewdin
keywords: NOSOSCF
formula: C19H34O3
InChI: InChI=1/C19H34O3/c1-15(2)22-18(20)14-17(4)11-8-10-16(3)12-9-13-19(5,6)21-7/h8,11,14-16H,9-10,12-13H2,1-7H3
56 atoms
O  -4.431821 3.438965 1.375593
O  4.8915 -1.177572 -0.826148
O  4.382641 -2.038397 1.175768
C  -3.621987 1.055487 -0.226181
C  -3.048667 2.457796 -0.390624
C  -2.59794 -0.018601 -0.574575
C  -3.973669 3.607353 0.041713
C  -3.143984 -1.445405 -0.536251
C  -2.114859 -2.444247 -1.097192
C  -5.247273 3.624606 -0.79753
C  -3.239151 4.938044 -0.138348
C  -3.617525 -1.847977 0.857004
C  -0.867459 -2.545408 -0.284456
C  -3.477645 3.468953 2.396427
C  0.334873 -2.133801 -0.695021
C  1.569011 -2.200802 0.084251
C  1.485777 -2.778162 1.463041
C  2.688832 -1.732721 -0.500919
C  4.042103 -1.684086 0.07453
C  6.273809 -1.042544 -0.465619
C  7.055394 -1.052204 -1.76439
C  6.490769 0.233517 0.328309
H  -4.501003 0.931314 -0.866216
H  -3.973873 0.923936 0.799552
H  -2.778704 2.62008 -1.439319
H  -2.102368 2.522617 0.158401
H  -1.739742 0.061055 0.101517
H  -2.202915 0.179624 -1.577779
H  -4.009647 -1.491301 -1.207855
H  -1.864509 -2.161637 -2.123423
H  -2.585618 -3.431824 -1.152049
H  -5.849548 2.732225 -0.629686
H  -5.008145 3.677806 -1.860212
H  -5.862945 4.489328 -0.547089
H  -3.841279 5.769426 0.231888
H  -2.276954 4.959421 0.375959
H  -3.03805 5.117885 -1.195058
H  -4.474363 -1.255665 1.176571
H  -2.833566 -1.710132 1.604656
H  -3.923281 -2.895523 0.885464
H  -0.973733 -2.976999 0.705787
H  -4.008902 3.296972 3.33237
H  -2.963258 4.43302 2.480305
H  -2.7126 2.688771 2.30205
H  0.421888 -1.707546 -1.690695
H  1.105517 -3.800337 1.418566
H  2.442139 -2.78935 1.969778
H  0.78133 -2.203494 2.067607
H  2.610548 -1.343409 -1.509341
H  6.568629 -1.900495 0.144184
H  6.782841 -0.208767 -2.400101
H  8.122807 -0.981876 -1.55497
H  6.885271 -1.971528 -2.32438
H  7.548523 0.344932 0.56923
H  5.938655 0.222449 1.266517
H  6.185255 1.108495 -0.247348
totalener: -970.26889070 hartree
nucrepener: 1781.43581312 hartree
electener: -2751.70470382 hartree
oneelecener: -4854.83299751 hartree
twoeener: 2103.12829369 hartree
kineticenergy: 965.65305377 hartree
xcener: -96.764921454960 hartree
chargesum: -0.0000000
charge: -0.347623 -0.273773 -0.404849 -0.121974 -0.276296 -0.189180 0.378874 0.124200 -0.154908 -0.295665 -0.320195 -0.323126 -0.129711 -0.128330 -0.094154 0.042309 -0.267188 -0.163628 0.412972 0.143945 -0.228987 -0.260349 0.067777 0.080141 0.081197 0.080799 0.072806 0.065498 0.041992 0.078144 0.095197 0.092261 0.075552 0.093379 0.103954 0.086621 0.086430 0.094372 0.078187 0.092272 0.100915 0.115232 0.082163 0.072855 0.071108 0.091032 0.125302 0.086273 0.093375 0.059307 0.080916 0.076230 0.090708 0.080299 0.103762 0.081582
qa: -0.3476 -0.2738 -0.4048 -0.1220 -0.2763 -0.1892 0.3789 0.1242 -0.1549 -0.2957 -0.3202 -0.3231 -0.1297 -0.1283 -0.0942 0.0423 -0.2672 -0.1636 0.4130 0.1439 -0.2290 -0.2603 0.0678 0.0801 0.0812 0.0808 0.0728 0.0655 0.0420 0.0781 0.0952 0.0923 0.0756 0.0934 0.1040 0.0866 0.0864 0.0944 0.0782 0.0923 0.1009 0.1152 0.0822 0.0729 0.0711 0.0910 0.1253 0.0863 0.0934 0.0593 0.0809 0.0762 0.0907 0.0803 0.1038 0.0816
va: 1.9907 2.1359 2.0926 3.8346 3.8994 3.9140 3.8031 3.7267 3.9421 3.9134 3.9294 3.9677 3.8652 3.9599 3.9414 3.6760 3.9215 3.8215 4.2239 3.8560 3.9270 3.9096 1.0139 1.0217 1.0170 1.0034 1.0109 1.0147 1.0182 1.0161 1.0072 1.0108 1.0066 1.0125 1.0081 1.0013 1.0100 1.0053 0.9984 1.0047 1.0022 0.9938 0.9852 0.9795 1.0319 0.9974 1.0399 0.9984 1.0373 1.0248 1.0095 1.0081 1.0113 1.0091 1.0170 1.0085
dispcorr: -0.024102989 hartree
energy: -970.292993688134
dipole: -16.83876 16.72379 -0.11497 12.59580 -12.35553 0.24027 -0.67714 0.06484 -0.61231
magnitude: 0.66773 au
magnitude: 1.69724 debye
