program: Orca
programVersion: 5.0.2
elementType: O O O C C C C C C C C C C C C C C C C C C C H H H H H H H H H H H H H H H H H H H H H H H H H H H H H H H H H H
charge: 0
multiplicity: 1
keywords: wb97x-d3
keywords: def2-TZVPP
keywords: def2/J RIJCOSX
keywords: DEFGRID2
keywords: scfconv7
keywords: smallprint printgap noloewdin
keywords: NOSOSCF
formula: C19H34O3
InChI: InChI=1/C19H34O3/c1-15(2)22-18(20)14-17(4)11-8-10-16(3)12-9-13-19(5,6)21-7/h8,11,14-16H,9-10,12-13H2,1-7H3
56 atoms
O  -5.923106 2.41463 -1.067299
O  5.327455 -2.242314 0.005033
O  4.989797 -0.030525 -0.067778
C  -3.57467 0.924677 -0.027519
C  -3.981022 2.32502 0.41701
C  -2.883996 0.148827 1.088146
C  -4.790436 3.137237 -0.607649
C  -2.596986 -1.319072 0.767013
C  -1.736656 -1.511132 -0.496521
C  -3.971329 3.401912 -1.86713
C  -5.192064 4.475944 0.016168
C  -1.966566 -2.018288 1.965638
C  -0.421337 -0.808235 -0.439604
C  -6.909423 2.092004 -0.131005
C  0.758701 -1.424445 -0.3345
C  2.061934 -0.767711 -0.259622
C  2.08694 0.728539 -0.292331
C  3.143118 -1.565871 -0.164104
C  4.552761 -1.154455 -0.07221
C  6.748216 -2.070788 0.104343
C  7.146786 -1.775819 1.539561
C  7.367196 -3.354797 -0.412041
H  -2.915311 0.993519 -0.897241
H  -4.455697 0.370367 -0.363797
H  -3.085138 2.900268 0.672629
H  -4.546698 2.252604 1.352832
H  -3.5147 0.180259 1.983131
H  -1.953558 0.653889 1.371904
H  -3.558698 -1.803384 0.56018
H  -2.29482 -1.154903 -1.367681
H  -1.577998 -2.581463 -0.653463
H  -3.731258 2.477553 -2.392254
H  -3.035873 3.90533 -1.621194
H  -4.524264 4.03871 -2.558633
H  -5.834927 5.043313 -0.658731
H  -5.716965 4.356388 0.96542
H  -4.306487 5.079859 0.216829
H  -1.808378 -3.080329 1.770822
H  -2.603977 -1.937661 2.847318
H  -0.998019 -1.582657 2.216229
H  -0.454361 0.276414 -0.479169
H  -6.5391 1.477249 0.698454
H  -7.668382 1.512217 -0.656064
H  -7.402628 2.971187 0.298792
H  0.771205 -2.510447 -0.300772
H  1.634917 1.089662 -1.21812
H  1.491451 1.130792 0.52951
H  3.088954 1.131806 -0.220227
H  2.983185 -2.637721 -0.151056
H  7.052499 -1.23621 -0.532848
H  6.833395 -2.581086 2.205686
H  8.231264 -1.686075 1.611863
H  6.714314 -0.841481 1.893276
H  8.454283 -3.279747 -0.384937
H  7.071513 -3.553018 -1.442054
H  7.076094 -4.210508 0.198565
totalener: -970.26889397 hartree
nucrepener: 1773.23816363 hartree
electener: -2743.50705760 hartree
oneelecener: -4838.36235807 hartree
twoeener: 2094.85530047 hartree
kineticenergy: 965.64773186 hartree
xcener: -96.764109224147 hartree
chargesum: -0.0000000
charge: -0.348741 -0.272649 -0.404459 -0.132705 -0.265925 -0.197354 0.379564 0.108262 -0.149342 -0.298699 -0.315541 -0.305544 -0.120753 -0.128537 -0.111773 0.046266 -0.269743 -0.162523 0.411026 0.141289 -0.258588 -0.228934 0.060002 0.087257 0.084533 0.076559 0.072390 0.074115 0.044066 0.098958 0.082845 0.092102 0.076853 0.094430 0.103888 0.085481 0.087847 0.084890 0.086473 0.087641 0.093548 0.071023 0.116541 0.081355 0.072720 0.090933 0.087015 0.125684 0.093619 0.059679 0.081433 0.079865 0.103593 0.076013 0.090744 0.081304
qa: -0.3487 -0.2726 -0.4045 -0.1327 -0.2659 -0.1974 0.3796 0.1083 -0.1493 -0.2987 -0.3155 -0.3055 -0.1208 -0.1285 -0.1118 0.0463 -0.2697 -0.1625 0.4110 0.1413 -0.2586 -0.2289 0.0600 0.0873 0.0845 0.0766 0.0724 0.0741 0.0441 0.0990 0.0828 0.0921 0.0769 0.0944 0.1039 0.0855 0.0878 0.0849 0.0865 0.0876 0.0935 0.0710 0.1165 0.0814 0.0727 0.0909 0.0870 0.1257 0.0936 0.0597 0.0814 0.0799 0.1036 0.0760 0.0907 0.0813
va: 1.9859 2.1358 2.0941 3.8275 3.8863 3.8614 3.7982 3.7611 3.9436 3.9146 3.9298 3.9696 3.8767 3.9621 3.9611 3.6734 3.9210 3.8227 4.2242 3.8582 3.9078 3.9273 1.0110 1.0198 1.0163 1.0050 1.0171 1.0046 1.0150 1.0034 1.0152 1.0105 1.0068 1.0131 1.0082 1.0015 1.0098 1.0070 1.0078 1.0004 1.0001 0.9794 0.9932 0.9852 1.0323 0.9972 0.9984 1.0403 1.0374 1.0242 1.0086 1.0091 1.0174 1.0081 1.0113 1.0096
dispcorr: -0.024437962 hartree
energy: -970.293331928937
dipole: -19.65619 19.12090 -0.53529 6.41035 -6.71460 -0.30426 5.44822 -5.00865 0.43957
magnitude: 0.75652 au
magnitude: 1.92293 debye
