program: Orca
programVersion: 5.0.2
elementType: O O O C C C C C C C C C C C C C C C C C C C H H H H H H H H H H H H H H H H H H H H H H H H H H H H H H H H H H
charge: 0
multiplicity: 1
keywords: wb97x-d3
keywords: def2-TZVPP
keywords: def2/J RIJCOSX
keywords: DEFGRID2
keywords: scfconv7
keywords: smallprint printgap noloewdin
keywords: NOSOSCF
formula: C19H34O3
InChI: InChI=1/C19H34O3/c1-15(2)22-18(20)14-17(4)11-8-10-16(3)12-9-13-19(5,6)21-7/h8,11,14-16H,9-10,12-13H2,1-7H3
56 atoms
O  -0.602699 1.923214 0.738704
O  3.639462 -0.112809 0.53831
O  3.30055 -0.510134 -1.639132
C  -2.951243 0.349713 -0.019073
C  -2.930067 1.734744 0.619427
C  -3.945796 -0.586941 0.660215
C  -1.733064 2.607052 0.21861
C  -4.093742 -1.983527 0.043722
C  -2.87214 -2.894833 0.270123
C  -1.872891 3.981414 0.876375
C  -1.663006 2.766027 -1.301408
C  -5.337204 -2.666894 0.607197
C  -1.656594 -2.521056 -0.508775
C  0.665347 2.368251 0.353344
C  -0.475491 -2.203362 0.025825
C  0.687286 -1.723828 -0.714716
C  0.619177 -1.748593 -2.209883
C  1.712364 -1.237536 0.011954
C  2.940485 -0.607852 -0.492052
C  4.861177 0.587091 0.26521
C  5.089288 1.519648 1.438475
C  6.004222 -0.394506 0.077674
H  -1.949432 -0.069464 0.027825
H  -3.20636 0.427542 -1.081165
H  -2.911744 1.628453 1.70931
H  -3.853981 2.272076 0.382856
H  -4.932162 -0.109124 0.655109
H  -3.678863 -0.696276 1.718234
H  -4.235041 -1.868575 -1.038713
H  -3.158931 -3.913591 -0.016283
H  -2.640787 -2.931746 1.339309
H  -2.776316 4.48417 0.529021
H  -1.03265 4.636928 0.641406
H  -1.934706 3.889171 1.961391
H  -2.622003 3.115028 -1.686407
H  -0.911896 3.49685 -1.605229
H  -1.428762 1.823293 -1.797253
H  -6.233073 -2.071523 0.427262
H  -5.250125 -2.809385 1.686817
H  -5.497219 -3.648351 0.158208
H  -1.784858 -2.48547 -1.586987
H  0.87117 2.214244 -0.711893
H  1.393132 1.782151 0.914619
H  0.842732 3.426469 0.581431
H  -0.377738 -2.219467 1.107466
H  0.330976 -2.741168 -2.558724
H  -0.148673 -1.053374 -2.557523
H  1.557301 -1.47503 -2.676027
H  1.622037 -1.256869 1.091515
H  4.738341 1.174215 -0.648866
H  4.255305 2.210078 1.566698
H  5.220492 0.965581 2.368832
H  5.989214 2.111561 1.271964
H  5.837591 -1.044486 -0.779446
H  6.137011 -1.013139 0.966427
H  6.934675 0.147875 -0.094359
totalener: -970.26607705 hartree
nucrepener: 1927.93645582 hartree
electener: -2898.20253287 hartree
oneelecener: -5148.17351368 hartree
twoeener: 2249.97098082 hartree
kineticenergy: 965.64795909 hartree
xcener: -96.763816357108 hartree
chargesum: 0.0000000
charge: -0.333311 -0.276136 -0.404312 -0.033898 -0.196951 -0.191794 0.321445 0.070555 -0.118557 -0.302702 -0.363829 -0.268890 -0.120412 -0.133209 -0.104267 0.057429 -0.270040 -0.188928 0.414523 0.139450 -0.227582 -0.258175 0.044865 0.059068 0.073953 0.065951 0.067561 0.062991 0.032185 0.087081 0.071051 0.083716 0.081843 0.095637 0.094611 0.097000 0.097622 0.081244 0.081078 0.080602 0.097148 0.094339 0.099912 0.086409 0.077826 0.093771 0.085175 0.124848 0.097821 0.059283 0.086176 0.082939 0.079026 0.104512 0.082144 0.080204
qa: -0.3333 -0.2761 -0.4043 -0.0339 -0.1970 -0.1918 0.3214 0.0706 -0.1186 -0.3027 -0.3638 -0.2689 -0.1204 -0.1332 -0.1043 0.0574 -0.2700 -0.1889 0.4145 0.1394 -0.2276 -0.2582 0.0449 0.0591 0.0740 0.0660 0.0676 0.0630 0.0322 0.0871 0.0711 0.0837 0.0818 0.0956 0.0946 0.0970 0.0976 0.0812 0.0811 0.0806 0.0971 0.0943 0.0999 0.0864 0.0778 0.0938 0.0852 0.1248 0.0978 0.0593 0.0862 0.0829 0.0790 0.1045 0.0821 0.0802
va: 2.0027 2.1188 2.0903 3.7900 3.8706 3.9571 3.8679 3.7814 3.9165 3.9302 3.9529 3.9422 3.8781 3.9455 3.9546 3.6571 3.9220 3.8066 4.1974 3.8549 3.9308 3.9138 1.0614 1.0099 1.0232 1.0169 1.0083 1.0129 1.0221 1.0055 1.0182 1.0090 1.0096 1.0122 1.0069 1.0017 0.9964 1.0082 1.0032 1.0080 1.0116 0.9791 1.0080 0.9866 1.0303 1.0001 0.9961 1.0380 1.0370 1.0243 1.0090 1.0093 1.0093 1.0173 1.0086 1.0092
dispcorr: -0.028082177 hartree
energy: -970.294159225059
dipole: -14.12666 13.63209 -0.49457 8.16821 -7.86673 0.30148 2.20766 -2.00582 0.20185
magnitude: 0.61338 au
magnitude: 1.55908 debye
