program: Orca
programVersion: 5.0.2
elementType: O O O C C C C C C C C C C C C C C C C C C C H H H H H H H H H H H H H H H H H H H H H H H H H H H H H H H H H H
charge: 0
multiplicity: 1
keywords: wb97x-d3
keywords: def2-TZVPP
keywords: def2/J RIJCOSX
keywords: DEFGRID2
keywords: scfconv7
keywords: smallprint printgap noloewdin
keywords: NOSOSCF
formula: C19H34O3
InChI: InChI=1/C19H34O3/c1-15(2)22-18(20)14-17(4)11-8-10-16(3)12-9-13-19(5,6)21-7/h8,11,14-16H,9-10,12-13H2,1-7H3
56 atoms
O  -2.100512 2.628947 -0.784702
O  4.310179 -0.255198 0.05524
O  3.951766 -2.399618 0.590401
C  -2.835836 0.569828 1.160967
C  -3.747066 1.62013 0.532382
C  -3.409139 -0.845541 1.157642
C  -3.06492 2.954755 0.208773
C  -3.753152 -1.425934 -0.217417
C  -2.605982 -1.281112 -1.231364
C  -2.417824 3.555551 1.457252
C  -4.107822 3.923353 -0.352496
C  -4.215384 -2.873454 -0.080259
C  -1.326768 -1.920084 -0.803662
C  -1.21655 3.633252 -1.190156
C  -0.171404 -1.261374 -0.679603
C  1.102835 -1.839984 -0.261593
C  1.130021 -3.30159 0.059586
C  2.159553 -1.006365 -0.199522
C  3.536702 -1.33853 0.194416
C  5.70325 -0.355499 0.380929
C  6.473668 -1.010195 -0.752531
C  6.17483 1.060138 0.649857
H  -2.624311 0.843688 2.198196
H  -1.870297 0.568296 0.653475
H  -4.597869 1.811059 1.19394
H  -4.174079 1.243368 -0.401944
H  -4.310724 -0.879071 1.779133
H  -2.685508 -1.505654 1.647473
H  -4.595478 -0.860512 -0.630475
H  -2.431434 -0.224169 -1.448277
H  -2.93077 -1.736631 -2.17416
H  -3.14879 3.618735 2.264599
H  -2.047572 4.56751 1.283964
H  -1.582951 2.950584 1.812575
H  -4.572602 3.51596 -1.251697
H  -4.895247 4.104285 0.380149
H  -3.679489 4.894912 -0.604753
H  -4.488861 -3.299646 -1.047034
H  -5.090259 -2.943807 0.567782
H  -3.44284 -3.509578 0.356362
H  -1.361071 -2.984197 -0.590798
H  -0.533136 3.952586 -0.395228
H  -1.72009 4.525894 -1.578847
H  -0.613534 3.219076 -1.998221
H  -0.1626 -0.197365 -0.901839
H  0.812109 -3.88063 -0.809435
H  2.110077 -3.645953 0.363641
H  0.423482 -3.521034 0.862355
H  2.002665 0.031058 -0.470682
H  5.815107 -0.95726 1.287113
H  6.359409 -0.446296 -1.679485
H  7.53631 -1.039226 -0.508704
H  6.146488 -2.034006 -0.923379
H  6.070361 1.688224 -0.235841
H  7.227462 1.053818 0.932831
H  5.613159 1.51948 1.463092
totalener: -970.26778410 hartree
nucrepener: 1856.71454561 hartree
electener: -2826.98232971 hartree
oneelecener: -5005.68254607 hartree
twoeener: 2178.70021636 hartree
kineticenergy: 965.64610600 hartree
xcener: -96.767011873989 hartree
chargesum: -0.0000000
charge: -0.330064 -0.273103 -0.405063 -0.113617 -0.180241 -0.193983 0.300194 0.051165 -0.107240 -0.360628 -0.301183 -0.285044 -0.160649 -0.129638 -0.084352 0.036097 -0.272222 -0.159055 0.409938 0.143401 -0.260415 -0.231001 0.077420 0.080054 0.077489 0.080780 0.077121 0.077253 0.044937 0.074578 0.091387 0.093888 0.094137 0.104160 0.096715 0.084586 0.083603 0.087914 0.086702 0.072393 0.101537 0.086101 0.083335 0.104420 0.077372 0.091758 0.123672 0.088481 0.092333 0.059476 0.081211 0.079369 0.105361 0.080971 0.075890 0.090299
qa: -0.3301 -0.2731 -0.4051 -0.1136 -0.1802 -0.1940 0.3002 0.0512 -0.1072 -0.3606 -0.3012 -0.2850 -0.1606 -0.1296 -0.0844 0.0361 -0.2722 -0.1591 0.4099 0.1434 -0.2604 -0.2310 0.0774 0.0801 0.0775 0.0808 0.0771 0.0773 0.0449 0.0746 0.0914 0.0939 0.0941 0.1042 0.0967 0.0846 0.0836 0.0879 0.0867 0.0724 0.1015 0.0861 0.0833 0.1044 0.0774 0.0918 0.1237 0.0885 0.0923 0.0595 0.0812 0.0794 0.1054 0.0810 0.0759 0.0903
va: 2.0045 2.1340 2.0932 3.8469 3.7700 3.9472 3.8913 3.8018 3.8870 3.9454 3.9210 3.9522 3.8776 3.9567 3.9263 3.6728 3.9200 3.8192 4.2232 3.8591 3.9035 3.9294 1.0080 1.0336 1.0188 1.0231 1.0070 1.0102 1.0139 1.0420 1.0082 1.0071 1.0022 0.9980 1.0109 1.0095 1.0086 1.0063 1.0071 1.0052 1.0036 0.9819 0.9867 0.9948 1.0322 0.9966 1.0402 0.9984 1.0380 1.0231 1.0086 1.0091 1.0185 1.0095 1.0083 1.0112
dispcorr: -0.025943268 hartree
energy: -970.293727363351
dipole: -16.46165 15.84015 -0.62150 10.16899 -9.19937 0.96963 1.35063 -1.38846 -0.03783
magnitude: 1.15233 au
magnitude: 2.92899 debye
