program: Orca
programVersion: 5.0.2
elementType: O O O C C C C C C C C C C C C C C C C C C C H H H H H H H H H H H H H H H H H H H H H H H H H H H H H H H H H H
charge: 0
multiplicity: 1
keywords: wb97x-d3
keywords: def2-TZVPP
keywords: def2/J RIJCOSX
keywords: DEFGRID2
keywords: scfconv7
keywords: smallprint printgap noloewdin
keywords: NOSOSCF
formula: C19H34O3
InChI: InChI=1/C19H34O3/c1-15(2)22-18(20)14-17(4)11-8-10-16(3)12-9-13-19(5,6)21-7/h8,11,14-16H,9-10,12-13H2,1-7H3
56 atoms
O  -2.294544 2.733419 -1.31661
O  3.668135 -0.920575 0.836328
O  3.935193 -0.448219 -1.335456
C  -3.194091 0.496534 0.426534
C  -2.885614 1.90828 0.910152
C  -2.706962 -0.563185 1.405529
C  -3.052707 3.011182 -0.147161
C  -3.011529 -2.004935 0.99772
C  -2.46168 -2.353463 -0.400167
C  -2.664749 4.359698 0.464086
C  -4.495173 3.080916 -0.637773
C  -2.506872 -2.978567 2.058626
C  -0.999051 -2.091225 -0.545169
C  -0.905696 2.62888 -1.182472
C  -0.472087 -1.189527 -1.375046
C  0.959086 -0.89033 -1.515516
C  1.371237 -0.52648 -2.908121
C  1.760454 -0.940051 -0.436812
C  3.21775 -0.736754 -0.410417
C  5.072146 -0.774039 1.090803
C  5.204287 -0.46373 2.568858
C  5.819384 -2.03774 0.700641
H  -2.724906 0.344202 -0.546677
H  -4.270354 0.377219 0.266991
H  -1.862469 1.93592 1.301527
H  -3.523714 2.153721 1.765075
H  -3.151573 -0.378804 2.389667
H  -1.625125 -0.450587 1.542279
H  -4.100578 -2.116128 0.936825
H  -3.010873 -1.7978 -1.163347
H  -2.661912 -3.412939 -0.591825
H  -1.661175 4.353126 0.892008
H  -3.351745 4.620812 1.269777
H  -2.710323 5.153567 -0.28289
H  -4.791199 2.162725 -1.144885
H  -5.178397 3.242511 0.19671
H  -4.62407 3.90374 -1.342081
H  -2.97224 -2.777813 3.024608
H  -1.427303 -2.89988 2.20116
H  -2.731816 -4.013205 1.794866
H  -0.329889 -2.680856 0.075731
H  -0.506023 2.428346 -2.176942
H  -0.589437 1.807472 -0.528475
H  -0.434146 3.549108 -0.819629
H  -1.13499 -0.647324 -2.046133
H  2.419443 -0.271224 -2.997641
H  1.148227 -1.351739 -3.587309
H  0.772845 0.321441 -3.250552
H  1.310955 -1.151719 0.525688
H  5.454427 0.06602 0.504864
H  6.252934 -0.308671 2.822939
H  4.658597 0.440756 2.836993
H  4.829547 -1.284253 3.182414
H  6.877048 -1.933183 0.944986
H  5.745529 -2.236018 -0.366964
H  5.435396 -2.901513 1.244955
totalener: -970.26542178 hartree
nucrepener: 1892.84526947 hartree
electener: -2863.11069125 hartree
oneelecener: -5077.69404685 hartree
twoeener: 2214.58335560 hartree
kineticenergy: 965.64622863 hartree
xcener: -96.763780434686 hartree
chargesum: 0.0000000
charge: -0.343219 -0.275323 -0.403749 -0.147846 -0.272035 -0.142698 0.367144 0.058169 -0.128054 -0.320969 -0.288416 -0.290588 -0.132771 -0.122815 -0.127460 0.026248 -0.233081 -0.204109 0.427512 0.142398 -0.229677 -0.259314 0.068513 0.080434 0.082529 0.084675 0.080659 0.060750 0.043100 0.084059 0.093517 0.086327 0.086098 0.103168 0.091491 0.075064 0.093942 0.086615 0.075179 0.086768 0.103447 0.110923 0.068971 0.088153 0.099015 0.119186 0.096814 0.078643 0.099887 0.059303 0.076357 0.090085 0.081184 0.079620 0.104845 0.081332
qa: -0.3432 -0.2753 -0.4037 -0.1478 -0.2720 -0.1427 0.3671 0.0582 -0.1281 -0.3210 -0.2884 -0.2906 -0.1328 -0.1228 -0.1275 0.0262 -0.2331 -0.2041 0.4275 0.1424 -0.2297 -0.2593 0.0685 0.0804 0.0825 0.0847 0.0807 0.0607 0.0431 0.0841 0.0935 0.0863 0.0861 0.1032 0.0915 0.0751 0.0939 0.0866 0.0752 0.0868 0.1034 0.1109 0.0690 0.0882 0.0990 0.1192 0.0968 0.0786 0.0999 0.0593 0.0764 0.0901 0.0812 0.0796 0.1048 0.0813
va: 1.9951 2.1340 2.0943 3.8258 3.8973 3.8795 3.8204 3.8339 3.9002 3.9319 3.9154 3.9569 3.8569 3.9552 3.8595 3.7198 3.9163 3.8066 4.2154 3.8592 3.9284 3.9056 1.0324 1.0134 1.0020 1.0170 1.0125 1.0131 1.0152 1.0095 1.0077 1.0024 1.0094 1.0095 1.0099 1.0070 1.0136 1.0069 1.0038 1.0070 1.0077 0.9958 0.9755 0.9881 1.0065 1.0344 1.0019 1.0052 1.0371 1.0239 1.0083 1.0114 1.0093 1.0093 1.0176 1.0087
dispcorr: -0.027290487 hartree
energy: -970.292712271427
dipole: -13.37920 12.89895 -0.48025 3.86920 -4.07004 -0.20083 9.05239 -8.16175 0.89064
magnitude: 1.03160 au
magnitude: 2.62213 debye
