program: Orca
programVersion: 5.0.2
elementType: O O O C C C C C C C C C C C C C C C C C C C H H H H H H H H H H H H H H H H H H H H H H H H H H H H H H H H H H
charge: 0
multiplicity: 1
keywords: wb97x-d3
keywords: def2-TZVPP
keywords: def2/J RIJCOSX
keywords: DEFGRID2
keywords: scfconv7
keywords: smallprint printgap noloewdin
keywords: NOSOSCF
formula: C19H34O3
InChI: InChI=1/C19H34O3/c1-15(2)22-18(20)14-17(4)11-8-10-16(3)12-9-13-19(5,6)21-7/h8,11,14-16H,9-10,12-13H2,1-7H3
56 atoms
O  -6.468282 2.803445 0.490521
O  5.543988 -2.216186 0.448919
O  5.238963 -1.138036 -1.489277
C  -4.124042 1.058434 1.06499
C  -4.443541 1.669144 -0.295322
C  -3.605033 -0.374222 0.973945
C  -5.271567 2.964505 -0.256016
C  -2.327579 -0.587758 0.158093
C  -1.149222 0.200492 0.749445
C  -5.565766 3.419455 -1.687873
C  -4.516303 4.070137 0.473896
C  -2.004738 -2.075272 0.073879
C  0.095649 0.096664 -0.064447
C  -7.378085 1.83467 0.056632
C  1.231575 -0.46634 0.354302
C  2.461688 -0.589742 -0.424543
C  2.471193 0.00062 -1.79999
C  3.491095 -1.235854 0.157207
C  4.821374 -1.495584 -0.415774
C  6.883391 -2.584225 0.091948
C  7.840979 -1.446801 0.401514
C  7.202884 -3.840047 0.87916
H  -5.023373 1.055711 1.685339
H  -3.407158 1.686741 1.600188
H  -4.962731 0.924622 -0.91053
H  -3.51733 1.885974 -0.836661
H  -4.394012 -1.001777 0.544906
H  -3.439662 -0.758828 1.986516
H  -2.499544 -0.223755 -0.862194
H  -0.961611 -0.144077 1.771667
H  -1.425101 1.257623 0.82369
H  -6.212315 4.298132 -1.691319
H  -6.045431 2.642882 -2.285734
H  -4.639851 3.686044 -2.198504
H  -5.08065 5.002959 0.448861
H  -4.345979 3.815655 1.519831
H  -3.54813 4.250974 0.005584
H  -1.813383 -2.489348 1.066624
H  -1.122379 -2.268469 -0.535783
H  -2.836475 -2.632352 -0.359353
H  0.037276 0.507981 -1.068431
H  -6.984247 0.812813 0.114405
H  -7.73413 1.998585 -0.966554
H  -8.24181 1.89177 0.718264
H  1.261045 -0.879074 1.358907
H  2.23187 1.064487 -1.752094
H  3.424972 -0.114455 -2.298872
H  1.701531 -0.470569 -2.414512
H  3.346106 -1.623384 1.158914
H  6.920271 -2.804795 -0.978024
H  7.812344 -1.188844 1.461215
H  8.861743 -1.743102 0.157412
H  7.608234 -0.556781 -0.180842
H  7.166708 -3.656315 1.953718
H  8.20623 -4.187542 0.632933
H  6.50498 -4.64388 0.645857
totalener: -970.26868311 hartree
nucrepener: 1754.74374964 hartree
electener: -2725.01243275 hartree
oneelecener: -4801.29792815 hartree
twoeener: 2076.28549540 hartree
kineticenergy: 965.65035693 hartree
xcener: -96.764638332593 hartree
chargesum: 0.0000000
charge: -0.342578 -0.273703 -0.404527 -0.144179 -0.272020 -0.199674 0.355743 0.084322 -0.144709 -0.311873 -0.286173 -0.294605 -0.136885 -0.124896 -0.086499 0.037492 -0.268508 -0.163626 0.414800 0.141604 -0.258317 -0.228224 0.099928 0.074420 0.085012 0.078997 0.071771 0.081002 0.043309 0.077016 0.094467 0.104382 0.084131 0.085771 0.094842 0.094125 0.073512 0.077154 0.096326 0.086233 0.097498 0.069541 0.081045 0.116232 0.071778 0.089979 0.124594 0.087960 0.093609 0.059719 0.081798 0.079797 0.103479 0.081167 0.075998 0.090438
qa: -0.3426 -0.2737 -0.4045 -0.1442 -0.2720 -0.1997 0.3557 0.0843 -0.1447 -0.3119 -0.2862 -0.2946 -0.1369 -0.1249 -0.0865 0.0375 -0.2685 -0.1636 0.4148 0.1416 -0.2583 -0.2282 0.0999 0.0744 0.0850 0.0790 0.0718 0.0810 0.0433 0.0770 0.0945 0.1044 0.0841 0.0858 0.0948 0.0941 0.0735 0.0772 0.0963 0.0862 0.0975 0.0695 0.0810 0.1162 0.0718 0.0900 0.1246 0.0880 0.0936 0.0597 0.0818 0.0798 0.1035 0.0812 0.0760 0.0904
va: 1.9983 2.1351 2.0937 3.8293 3.8629 3.9114 3.8500 3.7172 3.9238 3.9280 3.9085 3.9590 3.8961 3.9595 3.9658 3.6819 3.9246 3.8207 4.2246 3.8573 3.9112 3.9265 1.0197 1.0074 1.0024 1.0135 1.0117 1.0117 1.0194 1.0195 1.0058 1.0096 1.0039 1.0094 1.0135 1.0101 1.0076 1.0073 1.0034 1.0073 1.0118 0.9808 0.9850 0.9942 1.0329 0.9979 1.0400 0.9974 1.0374 1.0250 1.0085 1.0091 1.0167 1.0097 1.0083 1.0112
dispcorr: -0.024374023 hartree
energy: -970.293057136367
dipole: -21.55580 21.07063 -0.48517 4.63691 -4.92505 -0.28814 0.55332 -0.43285 0.12047
magnitude: 0.57700 au
magnitude: 1.46661 debye
