program: Gaussian 09
title: 000054107
version: EM64L-G09RevD.01
frameworkgroup: C1[X(C17H17ClN2O2)]
method: RPBEPBE
basis: SDD
operation: Freq
keyword: #p
keyword: freq=noraman
keyword: PBEPBE/SDD
title: #p freq=noraman PBEPBE/SDD
converged: YES YES NO NO
title: Mulliken charges:
elementType: Cl O O N N C C C C C C C C C C C C C C C C C H H H H H H H H H H H H H H H H H
charge: -0.047051 -0.304133 -0.262994 -0.252624 -0.086785 -0.366392 -0.368989 0.344599 0.125280 0.206872 0.130286 0.198613 -0.331270 -0.315037 -0.619321 -0.622390 -0.320805 -0.237188 -0.344275 -0.095989 -0.251533 -0.202054 0.217427 0.261626 0.264235 0.196813 0.253217 0.279410 0.216790 0.195145 0.226710 0.220595 0.190625 0.237502 0.273622 0.259943 0.256757 0.236405 0.236357
chargesum: 0.00000
title: Mulliken charges with hydrogens summed into heavy atoms:
elementType: Cl O O N N C C C C C C C C C C C C C C C C C
charge: -0.047051 -0.304133 -0.262994 -0.252624 -0.086785 0.112661 0.092059 0.344599 0.125280 0.206872 0.130286 0.198613 -0.078053 -0.035627 0.019325 0.026333 -0.047183 0.022755 -0.087518 -0.095989 -0.015128 0.034303
polarizability: 2.43551514e+02 -1.13353613e+01 2.67978412e+02 -3.06653922e+01 -2.50331426e+00 1.43969763e+02
1716.lowfreq: -6.9852 -0.0010 0.0004 0.0008 6.4749 9.2005 15.2969 36.2006 38.7143
frequency: 13.7641 36.1458 38.7098 47.9433 65.9180 91.1925 109.2502 124.1777 158.4635 180.3844 188.9779 223.0258 233.4279 234.9575 251.2312 261.4225 310.1709 333.9698 334.3521 358.6519 380.3417 399.5813 404.4772 426.0788 435.0493 462.2453 477.1161 506.1519 540.7716 560.7759 579.0517 596.7323 617.3097 652.0961 679.5693 683.2995 709.5499 753.1321 765.2968 778.5777 794.4109 809.9461 819.6227 860.3382 866.9498 880.2953 901.1399 938.7175 961.3196 981.9681 992.0515 1029.3263 1035.1650 1038.1533 1054.0722 1058.6342 1072.4026 1082.8532 1091.9858 1113.5611 1137.1284 1144.1490 1166.4804 1168.7298 1183.7465 1195.1105 1239.7549 1253.0410 1265.1911 1271.7228 1292.4205 1304.3697 1321.7275 1352.7234 1369.1815 1378.2548 1382.3134 1394.6511 1422.3977 1435.8633 1438.8488 1447.0647 1461.7950 1465.3202 1471.1966 1475.2485 1476.4865 1485.4852 1487.9141 1545.4401 1576.9829 1586.4848 1598.4786 1613.3735 2856.0188 2864.7584 2887.3060 3018.6091 3020.9077 3048.0642 3067.2374 3075.0202 3083.1798 3120.9576 3139.6015 3154.0957 3154.9464 3167.2246 3176.9580 3179.0984 3183.5126
redmass: 3.7382 3.1187 5.2240 6.2285 3.6816 3.2216 4.9488 5.8963 6.4543 3.0639 4.5376 1.0849 1.3303 5.5112 3.8896 4.6821 4.1431 6.0981 6.6069 3.1231 3.9716 3.4499 4.1807 3.5062 3.5335 3.6151 4.8139 4.2032 5.6956 6.4465 5.2940 5.7644 5.5814 6.0558 6.7124 5.1224 3.9646 2.7860 1.5082 1.4887 5.8743 1.6341 3.2084 4.1468 1.4070 1.5013 5.2470 1.3405 1.3909 5.2097 1.3453 2.6454 2.2760 1.5528 2.1246 2.8590 1.7666 2.6789 1.3220 2.3605 1.4614 1.8572 1.3960 1.4401 2.5186 2.1997 1.4712 1.8687 1.7015 2.5015 2.4602 1.2777 1.3987 2.8125 3.0028 1.6367 9.8299 4.2057 1.1402 2.1607 1.2436 1.1698 1.0526 2.4812 1.0581 1.1396 2.4407 1.0941 1.0537 7.5906 8.8512 7.4313 7.4043 6.9447 1.0562 1.0581 1.0689 1.0730 1.0738 1.0590 1.0910 1.1001 1.0998 1.1053 1.0861 1.0902 1.0888 1.0948 1.1004 1.0961 1.0937
irintensity: 0.6217 0.3249 1.5475 0.5376 1.0464 3.0751 0.1178 1.7356 0.6053 0.7654 0.7433 1.1641 0.2642 2.4136 0.5945 1.3574 8.2944 3.9806 0.5813 5.4567 18.0496 4.0827 1.4646 1.4543 1.4159 2.8969 12.8825 10.3851 0.5576 9.3157 16.3948 13.8544 6.8055 3.9136 4.0377 18.9998 15.4917 11.0084 17.3416 52.6731 5.9161 39.1174 3.3273 31.6969 24.7409 8.4759 72.6435 0.3758 4.6065 2.2447 1.0365 6.2961 18.2264 26.0147 10.2154 57.0793 12.9118 36.6599 2.6489 46.9682 2.3932 17.7261 16.4316 12.1400 49.8453 64.8050 7.0255 22.3912 16.8280 8.7957 151.6503 70.6432 9.2619 158.5752 5.0748 29.8934 0.6808 7.1376 4.2262 88.1685 16.9068 25.0166 18.3884 15.7538 11.0537 76.0618 223.5596 16.0699 9.6966 176.6803 69.4793 79.3023 8.5305 38.6027 66.8796 159.3606 105.4490 30.7528 56.9165 19.0610 1.0584 41.7633 40.7952 13.1139 3.1635 8.8957 4.1940 7.7244 16.8804 2.0003 0.5411
temp: 298.150 k
press: 1.00000 atm
elementType: 17 8 8 7 7 6 6 6 6 6 6 6 6 6 6 6 6 6 6 6 6 6 1 1 1 1 1 1 1 1 1 1 1 1 1 1 1 1 1
symmnumber: 1
zpe: 797866.3 jmol-1
zpe.correction: 0.303891 hartree
zpe.thermalcorrener: 0.324023 hartree
zpe.thermalcorrenthalpy: 0.324967 hartree
zpe.thermalcorrgfe: 0.253193 hartree
zpe.sumelectzpe: -1376.410230 hartree
zpe.sumelectthermal: -1376.390098 hartree
zpe.sumelectthermalent: -1376.389154 hartree
zpe.sumelectthermalfe: -1376.460928 hartree
dipole: 0.4841 -0.4140 -0.1092
dipole: 0.6463
quadrupole: -133.7571 -129.2581 -135.3569
quadrupole: 17.5382 1.8866 -4.0149
quadrupole: -0.9664 3.5326 -2.5662 17.5382 1.8866 -4.0149
hfenergy: -1376.7141211 hartree
pointgroup: C01[X(C17H17Cl1N2O2)]
dipole: -0.0301694 -0.2516191 -0.0208446 debye
polarizability: 239.7028249|-3.7619762|269.2006595|-32.6270367|14.7151307|146.5962055 unknown
InChI: InChI=1S/C17H17ClN2O2/c1-19(2)9-10-20-14-8-7-12(18)11-16(14)22-15-6-4-3-5-13(15)17(20)21/h3-8,11H,9-10H2,1-2H3
charge 0 multiplicity 1
39 atoms
Cl -0.200335 -5.483153 -1.461555
O  -1.090799 -1.042018 1.078274
O  0.030383 2.706949 -0.464283
N  0.670754 0.490987 -0.682001
N  4.138846 1.702591 0.315692
C  2.070239 0.9888 -0.858937
C  2.702737 1.403247 0.495885
C  0.396645 -0.900451 -0.897836
C  -0.292269 1.477339 -0.406979
C  -0.436239 -1.651036 -0.02636
C  -1.697424 1.098746 -0.029786
C  -2.051584 -0.044854 0.728917
C  1.00999 -1.59471 -1.975353
C  -0.629546 -3.036536 -0.19189
C  4.999696 0.50652 0.382941
C  4.63525 2.803115 1.164585
C  -2.71407 2.054998 -0.296387
C  0.837479 -2.981722 -2.157591
C  -3.355995 -0.229557 1.228303
C  0.024851 -3.688777 -1.250382
C  -4.029844 1.871216 0.169045
C  -4.349516 0.731155 0.946209
H  2.672008 0.187346 -1.312555
H  2.069597 1.862921 -1.529895
H  2.185283 2.308288 0.854877
H  2.526583 0.594338 1.246736
H  1.622681 -1.040408 -2.692739
H  -1.272378 -3.570863 0.511864
H  4.640879 -0.267363 -0.318946
H  5.035012 0.048922 1.404345
H  6.031528 0.771314 0.089738
H  5.671638 3.055126 0.873976
H  4.636097 2.561087 2.257331
H  4.011791 3.700893 1.011712
H  -2.428595 2.957823 -0.845277
H  1.319632 -3.49681 -2.992501
H  -3.568391 -1.119452 1.828034
H  -4.798186 2.618067 -0.054634
H  -5.365527 0.590622 1.330321
