program: Orca
programVersion: 5.0.2
elementType: O O O C C C C C C C C C C C C C C C C C C C H H H H H H H H H H H H H H H H H H H H H H H H H H H H H H H H H H
charge: 0
multiplicity: 1
keywords: wb97x-d3
keywords: def2-TZVPP
keywords: def2/J RIJCOSX
keywords: DEFGRID2
keywords: scfconv7
keywords: smallprint printgap noloewdin
keywords: NOSOSCF
formula: C19H34O3
InChI: InChI=1/C19H34O3/c1-15(2)22-18(20)14-17(4)11-8-10-16(3)12-9-13-19(5,6)21-7/h8,11,14-16H,9-10,12-13H2,1-7H3
56 atoms
O  -5.826463 3.583052 1.171961
O  6.125847 -1.727737 -0.519789
O  5.03033 -3.488679 0.323901
C  -4.088113 1.499321 0.097233
C  -5.16344 2.27749 -0.652543
C  -2.896872 1.182756 -0.800298
C  -6.370273 2.725763 0.180282
C  -1.833988 0.284813 -0.165165
C  -0.775035 -0.08551 -1.213806
C  -7.082263 1.521107 0.800939
C  -7.339553 3.481928 -0.731271
C  -1.19105 0.926977 1.058382
C  0.221763 -1.085457 -0.733314
C  -6.704432 4.134079 2.109636
C  1.546404 -0.922427 -0.777078
C  2.540499 -1.900598 -0.340472
C  2.039712 -3.173923 0.266408
C  3.836681 -1.581153 -0.524123
C  5.014943 -2.393386 -0.181006
C  7.398852 -2.329699 -0.248082
C  8.376195 -1.732045 -1.241271
C  7.804172 -2.066032 1.191642
H  -4.500349 0.560061 0.479922
H  -3.766272 2.074912 0.966547
H  -5.530372 1.673134 -1.488413
H  -4.711755 3.169649 -1.099528
H  -2.426605 2.119184 -1.12341
H  -3.261335 0.699887 -1.714324
H  -2.325912 -0.643869 0.152937
H  -0.264199 0.819906 -1.556938
H  -1.288033 -0.49998 -2.089826
H  -6.46674 1.034942 1.557886
H  -7.312251 0.781879 0.032525
H  -8.029106 1.796699 1.26812
H  -8.241168 3.800946 -0.205721
H  -6.864995 4.367412 -1.157544
H  -7.662694 2.84562 -1.556288
H  -0.719715 1.877224 0.795483
H  -0.418475 0.288469 1.487645
H  -1.921027 1.1276 1.841986
H  -0.193283 -2.007414 -0.334839
H  -7.472862 4.774678 1.661275
H  -6.107421 4.755813 2.776666
H  -7.211891 3.381216 2.723755
H  1.938386 0.006986 -1.180853
H  1.408921 -2.954458 1.129845
H  1.418298 -3.713158 -0.451209
H  2.840593 -3.829592 0.583517
H  4.064825 -0.622812 -0.976269
H  7.327224 -3.408201 -0.411023
H  8.469208 -0.653191 -1.109433
H  9.363351 -2.172429 -1.100591
H  8.068082 -1.925892 -2.268444
H  7.865092 -0.994772 1.390065
H  8.78582 -2.498834 1.387802
H  7.101125 -2.511315 1.894027
totalener: -970.27002194 hartree
nucrepener: 1709.41254851 hartree
electener: -2679.68257046 hartree
oneelecener: -4710.93280879 hartree
twoeener: 2031.25023833 hartree
kineticenergy: 965.63950935 hartree
xcener: -96.760783330925 hartree
chargesum: 0.0000000
charge: -0.332145 -0.274288 -0.404408 -0.110510 -0.156267 -0.182090 0.316014 0.089023 -0.107816 -0.365402 -0.312649 -0.302491 -0.158982 -0.123321 -0.068964 0.031829 -0.267573 -0.165982 0.415441 0.141212 -0.228251 -0.258010 0.057009 0.082214 0.062317 0.074819 0.068728 0.063384 0.034106 0.068299 0.087894 0.103583 0.093192 0.092870 0.084375 0.099835 0.085468 0.078265 0.095537 0.090770 0.097927 0.077111 0.109534 0.078979 0.071416 0.088556 0.089822 0.124160 0.093564 0.060022 0.080791 0.076027 0.090561 0.081516 0.080004 0.102978
qa: -0.3321 -0.2743 -0.4044 -0.1105 -0.1563 -0.1821 0.3160 0.0890 -0.1078 -0.3654 -0.3126 -0.3025 -0.1590 -0.1233 -0.0690 0.0318 -0.2676 -0.1660 0.4154 0.1412 -0.2283 -0.2580 0.0570 0.0822 0.0623 0.0748 0.0687 0.0634 0.0341 0.0683 0.0879 0.1036 0.0932 0.0929 0.0844 0.0998 0.0855 0.0783 0.0955 0.0908 0.0979 0.0771 0.1095 0.0790 0.0714 0.0886 0.0898 0.1242 0.0936 0.0600 0.0808 0.0760 0.0906 0.0815 0.0800 0.1030
va: 2.0140 2.1342 2.0937 3.8436 3.8250 3.9137 3.8638 3.7806 3.9262 3.9436 3.9218 3.9545 3.9145 3.9610 3.9503 3.6865 3.9219 3.8194 4.2234 3.8588 3.9265 3.9123 1.0088 1.0371 1.0181 1.0237 1.0129 1.0127 1.0214 1.0192 1.0068 1.0001 1.0063 1.0022 1.0056 1.0102 1.0095 1.0058 1.0065 1.0056 1.0108 0.9828 0.9960 0.9807 1.0316 0.9979 0.9974 1.0400 1.0376 1.0251 1.0095 1.0081 1.0113 1.0086 1.0091 1.0165
dispcorr: -0.023009950 hartree
energy: -970.293031890961
dipole: -26.33153 25.44057 -0.89096 13.00259 -12.47755 0.52504 2.68424 -2.90179 -0.21755
magnitude: 1.05679 au
magnitude: 2.68614 debye
