program: Orca
programVersion: 5.0.2
elementType: O O O C C C C C C C C C C C C C C C C C C C H H H H H H H H H H H H H H H H H H H H H H H H H H H H H H H H H H
charge: 0
multiplicity: 1
keywords: wb97x-d3
keywords: def2-TZVPP
keywords: def2/J RIJCOSX
keywords: DEFGRID2
keywords: scfconv7
keywords: smallprint printgap noloewdin
keywords: NOSOSCF
formula: C19H34O3
InChI: InChI=1/C19H34O3/c1-15(2)22-18(20)14-17(4)11-8-10-16(3)12-9-13-19(5,6)21-7/h8,11,14-16H,9-10,12-13H2,1-7H3
56 atoms
O  -6.737908 2.342423 -1.070283
O  5.771937 -2.487787 0.768158
O  5.605778 -1.854877 -1.372422
C  -4.152113 1.375278 0.063346
C  -5.180902 2.211466 0.815767
C  -2.751468 1.565522 0.635968
C  -6.633498 2.096762 0.323769
C  -1.631295 0.864492 -0.135121
C  -0.272171 1.268687 0.457324
C  -7.512895 3.055134 1.131379
C  -7.160202 0.675371 0.500243
C  -1.793983 -0.650807 -0.143656
C  0.898307 0.742196 -0.302932
C  -6.378991 3.611553 -1.531912
C  1.859198 -0.023432 0.220299
C  3.027939 -0.537925 -0.491199
C  3.153178 -0.2086 -1.946089
C  3.905597 -1.269547 0.223246
C  5.157954 -1.879384 -0.253135
C  7.033289 -3.129414 0.532926
C  7.735423 -3.185776 1.875868
C  6.827934 -4.509339 -0.067033
H  -4.15365 1.644017 -0.996959
H  -4.429884 0.319789 0.108408
H  -4.869776 3.262116 0.793948
H  -5.16572 1.934667 1.875149
H  -2.735115 1.222006 1.677348
H  -2.530496 2.638393 0.673032
H  -1.663633 1.219637 -1.173344
H  -0.217447 0.942629 1.501012
H  -0.214953 2.363451 0.472721
H  -7.544532 2.748254 2.177352
H  -8.536736 3.055915 0.754359
H  -7.143344 4.081697 1.112828
H  -8.217418 0.62163 0.237498
H  -6.62748 -0.032636 -0.134062
H  -7.054581 0.350188 1.535687
H  -1.799677 -1.046446 0.875264
H  -0.977523 -1.138679 -0.676536
H  -2.723789 -0.957094 -0.622321
H  0.945588 1.024764 -1.351119
H  -7.005183 4.414249 -1.126039
H  -6.512402 3.605214 -2.613517
H  -5.332144 3.868464 -1.32936
H  1.787274 -0.290602 1.270929
H  4.041352 -0.633278 -2.396256
H  2.280571 -0.576847 -2.488872
H  3.179352 0.87383 -2.084837
H  3.694753 -1.432631 1.273738
H  7.619095 -2.519696 -0.160266
H  7.178981 -3.793782 2.590348
H  8.724754 -3.628369 1.75957
H  7.862972 -2.19014 2.300342
H  6.226798 -5.136973 0.59248
H  7.792434 -4.999154 -0.206261
H  6.34152 -4.457256 -1.039371
totalener: -970.26994379 hartree
nucrepener: 1716.32440789 hartree
electener: -2686.59435168 hartree
oneelecener: -4724.56250149 hartree
twoeener: 2037.96814982 hartree
kineticenergy: 965.63600849 hartree
xcener: -96.760145809004 hartree
chargesum: -0.0000000
charge: -0.347722 -0.273644 -0.404167 -0.124089 -0.268082 -0.173799 0.373608 0.096222 -0.110036 -0.316558 -0.296868 -0.309274 -0.156850 -0.124413 -0.074113 0.031982 -0.267242 -0.162513 0.414533 0.143885 -0.229363 -0.259457 0.075580 0.070416 0.076857 0.082695 0.066374 0.065295 0.037211 0.068176 0.087866 0.087086 0.104094 0.085254 0.093561 0.091845 0.076574 0.077070 0.098048 0.091618 0.099115 0.079887 0.116025 0.068803 0.071069 0.123655 0.089156 0.089618 0.093084 0.058601 0.080755 0.076167 0.090959 0.081026 0.080261 0.104157
qa: -0.3477 -0.2736 -0.4042 -0.1241 -0.2681 -0.1738 0.3736 0.0962 -0.1100 -0.3166 -0.2969 -0.3093 -0.1569 -0.1244 -0.0741 0.0320 -0.2672 -0.1625 0.4145 0.1439 -0.2294 -0.2595 0.0756 0.0704 0.0769 0.0827 0.0664 0.0653 0.0372 0.0682 0.0879 0.0871 0.1041 0.0853 0.0936 0.0918 0.0766 0.0771 0.0980 0.0916 0.0991 0.0799 0.1160 0.0688 0.0711 0.1237 0.0892 0.0896 0.0931 0.0586 0.0808 0.0762 0.0910 0.0810 0.0803 0.1042
va: 1.9854 2.1349 2.0940 3.8505 3.8985 3.8821 3.8076 3.7726 3.9316 3.9316 3.9182 3.9556 3.9116 3.9637 3.9554 3.6861 3.9232 3.8204 4.2236 3.8579 3.9276 3.9067 1.0163 1.0141 1.0042 1.0147 1.0117 1.0154 1.0214 1.0186 1.0075 1.0099 1.0085 1.0018 1.0122 1.0114 1.0062 1.0055 1.0066 1.0044 1.0106 0.9844 0.9932 0.9796 1.0320 1.0401 0.9978 0.9976 1.0376 1.0239 1.0094 1.0082 1.0114 1.0085 1.0090 1.0178
dispcorr: -0.023378194 hartree
energy: -970.293321979474
dipole: -25.96958 25.55109 -0.41849 6.84162 -6.37784 0.46377 4.69748 -3.92928 0.76820
magnitude: 0.99013 au
magnitude: 2.51671 debye
