program: Orca
programVersion: 5.0.2
elementType: O O O C C C C C C C C C C C C C C C C C C C H H H H H H H H H H H H H H H H H H H H H H H H H H H H H H H H H H
charge: 0
multiplicity: 1
keywords: wb97x-d3
keywords: def2-TZVPP
keywords: def2/J RIJCOSX
keywords: DEFGRID2
keywords: scfconv7
keywords: smallprint printgap noloewdin
keywords: NOSOSCF
formula: C19H34O3
InChI: InChI=1/C19H34O3/c1-15(2)22-18(20)14-17(4)11-8-10-16(3)12-9-13-19(5,6)21-7/h8,11,14-16H,9-10,12-13H2,1-7H3
56 atoms
O  -2.560724 3.450091 1.039685
O  4.458007 -1.08254 0.347637
O  3.768658 -0.198613 -1.589542
C  -2.668798 0.473121 1.107903
C  -3.097459 1.334529 -0.075239
C  -3.595661 -0.714645 1.35681
C  -2.415587 2.71076 -0.163909
C  -3.7481 -1.751053 0.238249
C  -2.491888 -2.610532 0.026338
C  -2.981031 3.480835 -1.359747
C  -0.90822 2.559079 -0.335267
C  -4.931712 -2.664007 0.54985
C  -1.33907 -1.931596 -0.633652
C  -3.856494 3.771396 1.45276
C  -0.089792 -1.92474 -0.161995
C  1.0649 -1.308337 -0.809595
C  0.859856 -0.697805 -2.160378
C  2.233665 -1.347493 -0.140408
C  3.529853 -0.802676 -0.573471
C  5.80755 -0.652441 0.117552
C  5.973825 0.805229 0.509999
C  6.691009 -1.573521 0.93572
H  -2.660345 1.084463 2.013717
H  -1.642204 0.131847 0.971302
H  -4.185814 1.468089 -0.049371
H  -2.900382 0.808945 -1.015001
H  -4.591817 -0.319531 1.586796
H  -3.271558 -1.235587 2.264907
H  -3.970033 -1.232156 -0.702131
H  -2.773528 -3.459321 -0.609064
H  -2.17908 -3.04226 0.982703
H  -2.735743 2.96921 -2.291053
H  -2.558008 4.485248 -1.410751
H  -4.067961 3.572184 -1.323918
H  -0.678205 1.991862 -1.237596
H  -0.430441 3.535291 -0.424843
H  -0.453619 2.043409 0.510156
H  -5.852791 -2.092818 0.670964
H  -4.766595 -3.217921 1.476992
H  -5.097922 -3.39392 -0.243825
H  -1.560038 -1.445833 -1.580384
H  -3.763138 4.325287 2.386809
H  -4.481072 2.891815 1.65079
H  -4.393654 4.409572 0.741885
H  0.101845 -2.407848 0.792261
H  0.102942 0.08688 -2.107126
H  1.766454 -0.268888 -2.567652
H  0.487308 -1.450717 -2.857417
H  2.247641 -1.832775 0.828571
H  6.042305 -0.768704 -0.943846
H  7.010223 1.112056 0.364775
H  5.348453 1.458375 -0.096068
H  5.724275 0.957384 1.561082
H  6.557368 -2.615256 0.644673
H  6.477854 -1.485835 2.001841
H  7.738902 -1.316088 0.781933
totalener: -970.26592168 hartree
nucrepener: 1864.19825909 hartree
electener: -2834.46418077 hartree
oneelecener: -5020.39705863 hartree
twoeener: 2185.93287786 hartree
kineticenergy: 965.65077929 hartree
xcener: -96.765405961921 hartree
chargesum: -0.0000000
charge: -0.344492 -0.273316 -0.404889 -0.100883 -0.304435 -0.207260 0.391460 0.051086 -0.115042 -0.314648 -0.303216 -0.269738 -0.135082 -0.127507 -0.104166 0.037322 -0.267900 -0.163515 0.416772 0.143694 -0.259913 -0.229032 0.102027 0.074347 0.087700 0.070148 0.071606 0.077642 0.044844 0.091043 0.070987 0.086223 0.104311 0.084091 0.067923 0.100420 0.099984 0.082075 0.082003 0.081316 0.095789 0.115790 0.070666 0.080178 0.076731 0.071732 0.127268 0.101489 0.093364 0.058778 0.080178 0.104065 0.082041 0.090573 0.081358 0.076009
qa: -0.3445 -0.2733 -0.4049 -0.1009 -0.3044 -0.2073 0.3915 0.0511 -0.1150 -0.3146 -0.3032 -0.2697 -0.1351 -0.1275 -0.1042 0.0373 -0.2679 -0.1635 0.4168 0.1437 -0.2599 -0.2290 0.1020 0.0743 0.0877 0.0701 0.0716 0.0776 0.0448 0.0910 0.0710 0.0862 0.1043 0.0841 0.0679 0.1004 0.1000 0.0821 0.0820 0.0813 0.0958 0.1158 0.0707 0.0802 0.0767 0.0717 0.1273 0.1015 0.0934 0.0588 0.0802 0.1041 0.0820 0.0906 0.0814 0.0760
va: 1.9976 2.1365 2.0932 3.7888 3.8942 3.9500 3.8013 3.7638 3.8905 3.9302 3.9152 3.9384 3.8840 3.9620 3.9301 3.6598 3.9157 3.8236 4.2240 3.8561 3.9085 3.9264 1.0207 1.0208 1.0036 1.0175 1.0083 1.0140 1.0159 1.0041 1.0191 1.0081 1.0094 1.0029 1.0008 1.0191 1.0076 1.0082 1.0037 1.0074 1.0109 0.9940 0.9805 0.9849 1.0301 0.9941 1.0411 0.9989 1.0376 1.0245 1.0088 1.0174 1.0085 1.0113 1.0095 1.0082
dispcorr: -0.026814529 hartree
energy: -970.292736208340
dipole: -18.06937 17.33611 -0.73326 4.77150 -5.21399 -0.44249 2.78952 -2.56879 0.22073
magnitude: 0.88441 au
magnitude: 2.24799 debye
