program: Orca
programVersion: 5.0.2
elementType: O O O C C C C C C C C C C C C C C C C C C C H H H H H H H H H H H H H H H H H H H H H H H H H H H H H H H H H H
charge: 0
multiplicity: 1
keywords: wb97x-d3
keywords: def2-TZVPP
keywords: def2/J RIJCOSX
keywords: DEFGRID2
keywords: scfconv7
keywords: smallprint printgap noloewdin
keywords: NOSOSCF
formula: C19H34O3
InChI: InChI=1/C19H34O3/c1-15(2)22-18(20)14-17(4)11-8-10-16(3)12-9-13-19(5,6)21-7/h8,11,14-16H,9-10,12-13H2,1-7H3
56 atoms
O  -6.833716 1.527657 0.619067
O  6.153999 -1.637253 -0.518395
O  5.05331 -3.338187 0.43509
C  -3.939627 1.748353 0.185446
C  -5.049324 2.515443 -0.524622
C  -2.816007 1.364797 -0.771717
C  -6.299913 2.806949 0.313001
C  -1.700468 0.527663 -0.144287
C  -0.741321 0.026559 -1.235037
C  -7.281268 3.617789 -0.536468
C  -5.941935 3.594874 1.575458
C  -0.941409 1.28957 0.935818
C  0.254575 -0.963853 -0.734403
C  -7.938764 1.46983 1.47224
C  1.58003 -0.828415 -0.8226
C  2.568626 -1.792343 -0.3428
C  2.060208 -3.032653 0.322629
C  3.866389 -1.486942 -0.537749
C  5.041954 -2.278515 -0.140793
C  7.427143 -2.211513 -0.19211
C  8.412434 -1.677436 -1.213265
C  7.813281 -1.844894 1.230041
H  -4.35185 0.84459 0.641233
H  -3.538347 2.35376 1.00216
H  -5.363248 1.955119 -1.411677
H  -4.6521 3.466898 -0.892628
H  -2.380333 2.269528 -1.213046
H  -3.247867 0.802516 -1.606908
H  -2.165719 -0.352692 0.317989
H  -0.230411 0.877426 -1.696812
H  -1.334756 -0.445512 -2.026696
H  -7.557567 3.072588 -1.440144
H  -6.832434 4.564578 -0.839155
H  -8.197245 3.86017 0.004856
H  -6.828089 3.949854 2.104432
H  -5.354745 2.997245 2.273436
H  -5.353769 4.476083 1.31539
H  -0.485188 2.193032 0.523101
H  -0.140037 0.686742 1.363651
H  -1.592888 1.592696 1.755044
H  -0.163906 -1.851285 -0.267256
H  -8.229497 0.421869 1.545075
H  -8.806754 2.027409 1.100913
H  -7.722092 1.824794 2.486362
H  1.976969 0.067834 -1.291233
H  1.457505 -2.770081 1.194197
H  1.408854 -3.583375 -0.358614
H  2.856605 -3.692023 0.643207
H  4.097854 -0.553773 -1.038053
H  7.363336 -3.299021 -0.280793
H  8.496869 -0.591374 -1.155907
H  9.400536 -2.099666 -1.030159
H  8.118354 -1.944739 -2.228004
H  7.107152 -2.24825 1.954168
H  7.860758 -0.762013 1.35466
H  8.796934 -2.252407 1.465941
totalener: -970.27009438 hartree
nucrepener: 1710.98393075 hartree
electener: -2681.25402513 hartree
oneelecener: -4714.05389885 hartree
twoeener: 2032.79987372 hartree
kineticenergy: 965.64340606 hartree
xcener: -96.761648752368 hartree
chargesum: -0.0000000
charge: -0.334422 -0.273903 -0.403974 -0.113126 -0.150930 -0.175339 0.313461 0.089397 -0.106372 -0.305427 -0.369951 -0.305847 -0.154442 -0.122928 -0.077511 0.034978 -0.267535 -0.164797 0.414874 0.140664 -0.228449 -0.258370 0.077498 0.059353 0.074268 0.062994 0.063273 0.066882 0.035236 0.067429 0.088500 0.098543 0.084631 0.083482 0.095615 0.101843 0.094798 0.075555 0.097531 0.088580 0.096768 0.110595 0.075607 0.080089 0.071727 0.088824 0.089956 0.124139 0.093208 0.060492 0.080954 0.076317 0.090516 0.103001 0.081672 0.080075
qa: -0.3344 -0.2739 -0.4040 -0.1131 -0.1509 -0.1753 0.3135 0.0894 -0.1064 -0.3054 -0.3700 -0.3058 -0.1544 -0.1229 -0.0775 0.0350 -0.2675 -0.1648 0.4149 0.1407 -0.2284 -0.2584 0.0775 0.0594 0.0743 0.0630 0.0633 0.0669 0.0352 0.0674 0.0885 0.0985 0.0846 0.0835 0.0956 0.1018 0.0948 0.0756 0.0975 0.0886 0.0968 0.1106 0.0756 0.0801 0.0717 0.0888 0.0900 0.1241 0.0932 0.0605 0.0810 0.0763 0.0905 0.1030 0.0817 0.0801
va: 2.0095 2.1340 2.0944 3.8568 3.8104 3.9251 3.8668 3.7694 3.9305 3.9280 3.9447 3.9538 3.9112 3.9599 3.9539 3.6807 3.9227 3.8162 4.2244 3.8592 3.9265 3.9123 1.0306 1.0078 1.0263 1.0169 1.0100 1.0152 1.0230 1.0192 1.0080 1.0109 1.0090 1.0073 1.0013 0.9983 1.0062 1.0059 1.0064 1.0053 1.0116 0.9960 0.9834 0.9810 1.0318 0.9979 0.9973 1.0399 1.0376 1.0250 1.0094 1.0081 1.0113 1.0163 1.0085 1.0092
dispcorr: -0.023062082 hartree
energy: -970.293156462434
dipole: -24.00605 23.39336 -0.61269 17.01058 -16.02435 0.98623 4.12312 -4.16752 -0.04440
magnitude: 1.16190 au
magnitude: 2.95331 debye
