program: Orca
programVersion: 5.0.2
elementType: O O O C C C C C C C C C C C C C C C C C C C H H H H H H H H H H H H H H H H H H H H H H H H H H H H H H H H H H
charge: 0
multiplicity: 1
keywords: wb97x-d3
keywords: def2-TZVPP
keywords: def2/J RIJCOSX
keywords: DEFGRID2
keywords: scfconv7
keywords: smallprint printgap noloewdin
keywords: NOSOSCF
formula: C19H34O3
InChI: InChI=1/C19H34O3/c1-15(2)22-18(20)14-17(4)11-8-10-16(3)12-9-13-19(5,6)21-7/h8,11,14-16H,9-10,12-13H2,1-7H3
56 atoms
O  -3.358128 3.14056 -1.504676
O  4.868337 -2.041112 0.472076
O  4.396919 0.102855 0.035079
C  -3.842129 0.634998 0.055543
C  -4.034242 2.053301 0.582848
C  -3.230409 -0.279842 1.109649
C  -4.344436 3.116827 -0.48173
C  -3.03227 -1.733944 0.680258
C  -2.184089 -1.874317 -0.601507
C  -4.476755 4.484731 0.191574
C  -5.642048 2.790012 -1.212431
C  -2.426823 -2.543431 1.821179
C  -0.906067 -1.104277 -0.556424
C  -2.035712 3.388897 -1.127617
C  0.302261 -1.633162 -0.348942
C  1.55164 -0.878399 -0.27029
C  1.483643 0.600051 -0.496955
C  2.671805 -1.57201 0.010733
C  4.036501 -1.04141 0.15965
C  6.259229 -1.746176 0.661482
C  6.806848 -2.837903 1.559792
C  6.97135 -1.687152 -0.678361
H  -3.210643 0.664133 -0.836299
H  -4.800392 0.220525 -0.271801
H  -3.139227 2.351439 1.140972
H  -4.842568 2.063382 1.320485
H  -3.862912 -0.268776 2.003707
H  -2.266275 0.131914 1.430893
H  -4.017503 -2.156296 0.450908
H  -2.770495 -1.533805 -1.459421
H  -1.978808 -2.934449 -0.77227
H  -3.597812 4.750015 0.781396
H  -5.328294 4.490864 0.872766
H  -4.636906 5.26891 -0.549622
H  -5.564491 1.854285 -1.765625
H  -6.469496 2.700197 -0.507877
H  -5.891743 3.576243 -1.925848
H  -3.034169 -2.467075 2.724252
H  -1.423546 -2.191162 2.068049
H  -2.352597 -3.6015 1.564556
H  -0.995301 -0.030687 -0.691002
H  -1.60604 2.597423 -0.499787
H  -1.902522 4.339729 -0.599665
H  -1.447716 3.436248 -2.043935
H  0.383986 -2.708648 -0.216888
H  0.834114 1.064137 0.248312
H  2.45459 1.075916 -0.445784
H  1.045383 0.809446 -1.474407
H  2.58414 -2.642629 0.154921
H  6.353861 -0.779559 1.163134
H  6.279944 -2.870176 2.513274
H  6.724644 -3.819132 1.090189
H  7.861012 -2.653532 1.767252
H  8.034374 -1.497145 -0.525912
H  6.580308 -0.88775 -1.305341
H  6.873612 -2.632392 -1.214432
totalener: -970.26849140 hartree
nucrepener: 1816.97965717 hartree
electener: -2787.24814857 hartree
oneelecener: -4925.81376111 hartree
twoeener: 2138.56561253 hartree
kineticenergy: 965.64736102 hartree
xcener: -96.765097109441 hartree
chargesum: -0.0000000
charge: -0.342110 -0.272929 -0.405020 -0.179625 -0.250783 -0.166737 0.358422 0.098163 -0.146264 -0.316668 -0.286922 -0.307201 -0.098945 -0.111596 -0.122528 0.055446 -0.272191 -0.169086 0.413675 0.141974 -0.228852 -0.258918 0.078260 0.080705 0.081935 0.087986 0.080297 0.068855 0.043488 0.099182 0.082709 0.085143 0.085929 0.103443 0.091621 0.075671 0.094491 0.085369 0.088915 0.084538 0.069796 0.046538 0.087656 0.116190 0.079082 0.083117 0.128018 0.093181 0.093850 0.059699 0.090531 0.081011 0.076057 0.079804 0.103908 0.081722
qa: -0.3421 -0.2729 -0.4050 -0.1796 -0.2508 -0.1667 0.3584 0.0982 -0.1463 -0.3167 -0.2869 -0.3072 -0.0989 -0.1116 -0.1225 0.0554 -0.2722 -0.1691 0.4137 0.1420 -0.2289 -0.2589 0.0783 0.0807 0.0819 0.0880 0.0803 0.0689 0.0435 0.0992 0.0827 0.0851 0.0859 0.1034 0.0916 0.0757 0.0945 0.0854 0.0889 0.0845 0.0698 0.0465 0.0877 0.1162 0.0791 0.0831 0.1280 0.0932 0.0938 0.0597 0.0905 0.0810 0.0761 0.0798 0.1039 0.0817
va: 2.0014 2.1360 2.0932 3.8294 3.8524 3.8593 3.8328 3.7702 3.9279 3.9351 3.9154 3.9687 3.8574 3.9580 3.9464 3.6464 3.9219 3.8338 4.2206 3.8575 3.9271 3.9096 1.0219 1.0129 1.0051 1.0175 1.0149 1.0080 1.0152 1.0058 1.0151 1.0033 1.0092 1.0101 1.0101 1.0069 1.0138 1.0085 1.0001 1.0067 1.0057 0.9773 0.9860 0.9950 1.0282 0.9969 1.0418 0.9963 1.0375 1.0245 1.0115 1.0095 1.0080 1.0090 1.0171 1.0086
dispcorr: -0.025711300 hartree
energy: -970.294202699133
dipole: -18.09593 17.59568 -0.50025 5.11443 -5.51534 -0.40092 3.81496 -3.32883 0.48613
magnitude: 0.80455 au
magnitude: 2.04501 debye
