program: Orca
programVersion: 5.0.2
elementType: O O O C C C C C C C C C C C C C C C C C C C H H H H H H H H H H H H H H H H H H H H H H H H H H H H H H H H H H
charge: 0
multiplicity: 1
keywords: wb97x-d3
keywords: def2-TZVPP
keywords: def2/J RIJCOSX
keywords: DEFGRID2
keywords: scfconv7
keywords: smallprint printgap noloewdin
keywords: NOSOSCF
formula: C19H34O3
InChI: InChI=1/C19H34O3/c1-15(2)22-18(20)14-17(4)11-8-10-16(3)12-9-13-19(5,6)21-7/h8,11,14-16H,9-10,12-13H2,1-7H3
56 atoms
O  -6.160315 2.654812 -1.149574
O  5.696678 -2.301299 0.748354
O  5.342956 -1.882167 -1.420747
C  -3.917345 1.316469 0.164334
C  -5.239693 1.73918 0.794539
C  -3.448015 -0.035412 0.689613
C  -5.887782 2.995376 0.201091
C  -2.161731 -0.567486 0.053836
C  -0.941388 0.285236 0.436984
C  -4.947686 4.198041 0.308705
C  -7.184214 3.285379 0.961624
C  -1.941713 -2.025878 0.439333
C  0.288723 -0.079231 -0.323422
C  -6.644235 3.660579 -1.990426
C  1.409158 -0.560272 0.220979
C  2.620919 -0.930144 -0.507388
C  2.621394 -0.742479 -1.992638
C  3.646508 -1.418116 0.2179
C  4.954911 -1.872203 -0.278997
C  7.011913 -2.808444 0.480673
C  8.002552 -1.667983 0.324756
C  7.360744 -3.716421 1.643589
H  -3.157751 2.078077 0.36029
H  -4.030125 1.262033 -0.921164
H  -5.095544 1.89855 1.868056
H  -5.95788 0.917282 0.704252
H  -4.243907 -0.767463 0.51679
H  -3.318273 0.010526 1.777836
H  -2.281633 -0.514961 -1.036097
H  -0.762252 0.196057 1.51342
H  -1.162201 1.339829 0.244116
H  -5.439666 5.131812 0.031471
H  -4.069192 4.083408 -0.327091
H  -4.601901 4.314378 1.336669
H  -6.975925 3.470381 2.016124
H  -7.699731 4.168238 0.580323
H  -7.870644 2.439842 0.898476
H  -2.783597 -2.64551 0.12798
H  -1.840104 -2.130287 1.522327
H  -1.040168 -2.436793 -0.015273
H  0.230791 0.060001 -1.39943
H  -5.920583 4.465654 -2.161802
H  -7.575239 4.116911 -1.634032
H  -6.854781 3.195382 -2.95334
H  1.440088 -0.698746 1.298164
H  1.82498 -1.336355 -2.445345
H  2.417786 0.30132 -2.238544
H  3.560702 -1.02639 -2.449595
H  3.515484 -1.502112 1.290498
H  6.987169 -3.391854 -0.443649
H  7.755039 -1.032375 -0.523519
H  8.035807 -1.0528 1.225281
H  9.003171 -2.068127 0.156622
H  8.343306 -4.160981 1.485188
H  6.640264 -4.527621 1.746299
H  7.391405 -3.16447 2.583985
totalener: -970.26982233 hartree
nucrepener: 1724.00154608 hartree
electener: -2694.27136841 hartree
oneelecener: -4740.06804983 hartree
twoeener: 2045.79668142 hartree
kineticenergy: 965.64640697 hartree
xcener: -96.762429757985 hartree
chargesum: 0.0000000
charge: -0.335351 -0.273871 -0.405386 -0.105904 -0.152558 -0.179443 0.313995 0.082055 -0.124333 -0.369999 -0.301798 -0.289357 -0.142975 -0.123046 -0.090961 0.040126 -0.268994 -0.164456 0.415184 0.144618 -0.259557 -0.229913 0.054414 0.076643 0.063883 0.074608 0.070401 0.063752 0.038040 0.069775 0.093890 0.095898 0.100870 0.094944 0.084208 0.083491 0.097543 0.085598 0.073965 0.095162 0.097116 0.080903 0.075370 0.110824 0.072696 0.089152 0.089519 0.124669 0.093143 0.058536 0.104391 0.081040 0.079678 0.076098 0.090787 0.080917
qa: -0.3354 -0.2739 -0.4054 -0.1059 -0.1526 -0.1794 0.3140 0.0821 -0.1243 -0.3700 -0.3018 -0.2894 -0.1430 -0.1230 -0.0910 0.0401 -0.2690 -0.1645 0.4152 0.1446 -0.2596 -0.2299 0.0544 0.0766 0.0639 0.0746 0.0704 0.0638 0.0380 0.0698 0.0939 0.0959 0.1009 0.0949 0.0842 0.0835 0.0975 0.0856 0.0740 0.0952 0.0971 0.0809 0.0754 0.1108 0.0727 0.0892 0.0895 0.1247 0.0931 0.0585 0.1044 0.0810 0.0797 0.0761 0.0908 0.0809
va: 2.0082 2.1357 2.0925 3.8535 3.8039 3.9141 3.8652 3.7761 3.9250 3.9439 3.9278 3.9560 3.9036 3.9586 3.9599 3.6777 3.9236 3.8204 4.2226 3.8575 3.9063 3.9276 1.0113 1.0329 1.0177 1.0261 1.0148 1.0098 1.0226 1.0197 1.0090 1.0015 0.9982 1.0067 1.0090 1.0078 1.0113 1.0076 1.0061 1.0043 1.0116 0.9808 0.9837 0.9960 1.0320 0.9977 0.9976 1.0398 1.0373 1.0240 1.0182 1.0085 1.0091 1.0081 1.0112 1.0094
dispcorr: -0.023189208 hartree
energy: -970.293011541894
dipole: -23.83414 23.15163 -0.68251 10.36162 -9.79727 0.56435 4.64349 -4.02616 0.61732
magnitude: 1.07954 au
magnitude: 2.74396 debye
