program: Orca
programVersion: 5.0.2
elementType: O O O C C C C C C C C C C C C C C C C C C C H H H H H H H H H H H H H H H H H H H H H H H H H H H H H H H H H H
charge: 0
multiplicity: 1
keywords: wb97x-d3
keywords: def2-TZVPP
keywords: def2/J RIJCOSX
keywords: DEFGRID2
keywords: scfconv7
keywords: smallprint printgap noloewdin
keywords: NOSOSCF
formula: C19H34O3
InChI: InChI=1/C19H34O3/c1-15(2)22-18(20)14-17(4)11-8-10-16(3)12-9-13-19(5,6)21-7/h8,11,14-16H,9-10,12-13H2,1-7H3
56 atoms
O  -0.868102 1.989202 -0.299602
O  3.987908 -0.550654 0.766502
O  3.222191 0.236781 -1.182465
C  -3.246219 0.346711 -0.028681
C  -2.937833 1.636574 0.723345
C  -3.778097 -0.747217 0.892427
C  -2.093602 2.658737 -0.048419
C  -3.989967 -2.107422 0.213068
C  -2.709876 -2.96432 0.196613
C  -1.887072 3.891479 0.834009
C  -2.784773 3.066115 -1.35165
C  -5.106004 -2.890491 0.89754
C  -1.548772 -2.328503 -0.488154
C  0.161998 2.70763 -0.918954
C  -0.379626 -2.049428 0.094211
C  0.737252 -1.352179 -0.539037
C  0.55557 -0.906128 -1.955717
C  1.838139 -1.144804 0.21094
C  3.052718 -0.416222 -0.180535
C  5.242898 0.122487 0.589379
C  5.827384 0.309678 1.976131
C  6.156141 -0.686787 -0.314921
H  -2.340252 0.002269 -0.524824
H  -3.982868 0.532456 -0.816537
H  -2.396702 1.391758 1.643561
H  -3.871065 2.115347 1.036728
H  -4.725536 -0.409307 1.325996
H  -3.094076 -0.874196 1.739682
H  -4.292781 -1.930571 -0.826827
H  -2.942502 -3.910345 -0.305993
H  -2.439977 -3.219878 1.226336
H  -1.344348 3.633793 1.744791
H  -2.849013 4.313179 1.127148
H  -1.335842 4.682436 0.323597
H  -2.254002 3.869119 -1.865602
H  -2.864557 2.225772 -2.041622
H  -3.793107 3.430167 -1.149901
H  -6.05118 -2.348042 0.855896
H  -4.873267 -3.063857 1.950703
H  -5.262905 -3.864396 0.430734
H  -1.703627 -2.068914 -1.531498
H  0.996616 2.020121 -1.054174
H  0.520061 3.549184 -0.315209
H  -0.11319 3.096121 -1.906571
H  -0.243535 -2.321061 1.137216
H  0.25405 -1.747592 -2.581694
H  -0.243082 -0.163075 -2.002504
H  1.451362 -0.467313 -2.376445
H  1.849321 -1.539834 1.220258
H  5.061446 1.100296 0.134826
H  6.01894 -0.648775 2.460782
H  6.774804 0.844752 1.909384
H  5.161297 0.889365 2.614923
H  5.73699 -0.798387 -1.313547
H  6.338796 -1.678896 0.101476
H  7.118861 -0.184134 -0.41513
totalener: -970.26776758 hartree
nucrepener: 1911.85837110 hartree
electener: -2882.12613868 hartree
oneelecener: -5116.25746857 hartree
twoeener: 2234.13132989 hartree
kineticenergy: 965.63468729 hartree
xcener: -96.762077970261 hartree
chargesum: 0.0000000
charge: -0.328692 -0.273276 -0.419690 -0.080839 -0.169402 -0.171397 0.313117 0.059432 -0.141181 -0.321292 -0.353424 -0.276841 -0.111706 -0.127484 -0.098498 0.062478 -0.304635 -0.146640 0.409409 0.145899 -0.229650 -0.259600 0.050850 0.064585 0.073940 0.068433 0.072901 0.064921 0.037582 0.085985 0.069122 0.101525 0.084768 0.086807 0.090174 0.100083 0.091420 0.081815 0.083377 0.080354 0.104654 0.109226 0.086828 0.081590 0.069564 0.100591 0.097952 0.124570 0.090704 0.057355 0.081991 0.075585 0.090105 0.103371 0.081863 0.079322
qa: -0.3287 -0.2733 -0.4197 -0.0808 -0.1694 -0.1714 0.3131 0.0594 -0.1412 -0.3213 -0.3534 -0.2768 -0.1117 -0.1275 -0.0985 0.0625 -0.3046 -0.1466 0.4094 0.1459 -0.2297 -0.2596 0.0508 0.0646 0.0739 0.0684 0.0729 0.0649 0.0376 0.0860 0.0691 0.1015 0.0848 0.0868 0.0902 0.1001 0.0914 0.0818 0.0834 0.0804 0.1047 0.1092 0.0868 0.0816 0.0696 0.1006 0.0980 0.1246 0.0907 0.0574 0.0820 0.0756 0.0901 0.1034 0.0819 0.0793
va: 2.0022 2.1445 2.0594 3.8294 3.8364 3.9264 3.8745 3.7762 3.9547 3.9216 3.9523 3.9459 3.8961 3.9363 3.9400 3.6668 3.9086 3.8208 4.1979 3.8560 3.9282 3.9071 1.0501 1.0119 1.0243 1.0168 1.0067 1.0133 1.0209 1.0080 1.0154 1.0083 1.0105 1.0038 1.0063 1.0009 1.0064 1.0067 1.0022 1.0077 1.0045 1.0068 0.9898 0.9827 1.0305 1.0015 0.9973 1.0351 1.0365 1.0254 1.0093 1.0081 1.0112 1.0182 1.0087 1.0092
dispcorr: -0.027678934 hartree
energy: -970.295446510226
dipole: -14.96173 14.46870 -0.49303 6.18267 -6.07558 0.10709 1.80889 -1.51130 0.29759
magnitude: 0.58575 au
magnitude: 1.48886 debye
