program: Orca
programVersion: 5.0.2
elementType: O O O C C C C C C C C C C C C C C C C C C C H H H H H H H H H H H H H H H H H H H H H H H H H H H H H H H H H H
charge: 0
multiplicity: 1
keywords: wb97x-d3
keywords: def2-TZVPP
keywords: def2/J RIJCOSX
keywords: DEFGRID2
keywords: scfconv7
keywords: smallprint printgap noloewdin
keywords: NOSOSCF
formula: C19H34O3
InChI: InChI=1/C19H34O3/c1-15(2)22-18(20)14-17(4)11-8-10-16(3)12-9-13-19(5,6)21-7/h8,11,14-16H,9-10,12-13H2,1-7H3
56 atoms
O  -3.019213 3.571824 -0.944811
O  4.558616 -1.145502 0.707037
O  4.206268 -1.299244 -1.498669
C  -3.531104 0.851868 0.206656
C  -3.007928 2.056961 0.981112
C  -2.842463 -0.437741 0.637525
C  -3.401386 3.43117 0.416103
C  -3.321732 -1.689417 -0.098688
C  -2.326801 -2.849218 0.091008
C  -2.780131 4.528561 1.284105
C  -4.916692 3.601791 0.40339
C  -4.716582 -2.114346 0.345647
C  -1.039083 -2.610913 -0.622204
C  -1.66174 3.438996 -1.255065
C  0.13261 -2.375984 -0.026598
C  1.387959 -2.066828 -0.707825
C  1.384072 -2.073458 -2.204827
C  2.449108 -1.777484 0.070464
C  3.800498 -1.392786 -0.366826
C  5.917269 -0.727294 0.509801
C  5.972885 0.762524 0.218602
C  6.663725 -1.093912 1.777353
H  -3.372026 0.999441 -0.865383
H  -4.612612 0.768352 0.342414
H  -1.915725 1.993582 1.048707
H  -3.357903 2.002843 2.016942
H  -2.972117 -0.588515 1.716372
H  -1.766274 -0.317668 0.479544
H  -3.362315 -1.458341 -1.171057
H  -2.780838 -3.770074 -0.290395
H  -2.150508 -3.007709 1.159643
H  -1.697961 4.425611 1.380202
H  -3.192724 4.492704 2.293045
H  -2.991237 5.516595 0.87232
H  -5.188807 4.597705 0.051743
H  -5.395973 2.877119 -0.254499
H  -5.327885 3.475164 1.405475
H  -5.446833 -1.315972 0.213274
H  -4.721133 -2.393353 1.401907
H  -5.070482 -2.974978 -0.224057
H  -1.103253 -2.594313 -1.706573
H  -1.0214 4.154035 -0.725495
H  -1.559618 3.634793 -2.322648
H  -1.269281 2.432487 -1.064182
H  0.17043 -2.389488 1.059298
H  2.358164 -1.860246 -2.626363
H  1.050862 -3.045058 -2.574247
H  0.676872 -1.331658 -2.581509
H  2.312767 -1.807544 1.145484
H  6.340515 -1.275892 -0.335784
H  5.450485 1.011701 -0.703651
H  5.533982 1.336976 1.036019
H  7.01009 1.080366 0.106407
H  7.713247 -0.814983 1.683469
H  6.619214 -2.165632 1.970363
H  6.255521 -0.572548 2.644309
totalener: -970.26936824 hartree
nucrepener: 1803.90311122 hartree
electener: -2774.17247946 hartree
oneelecener: -4899.72666508 hartree
twoeener: 2125.55418562 hartree
kineticenergy: 965.64066900 hartree
xcener: -96.760996766024 hartree
chargesum: -0.0000000
charge: -0.345137 -0.273585 -0.403567 -0.153563 -0.257295 -0.160430 0.359807 0.064994 -0.118795 -0.312755 -0.291406 -0.278475 -0.101452 -0.121980 -0.134855 0.049744 -0.268582 -0.165747 0.414121 0.141774 -0.259073 -0.228608 0.079061 0.071323 0.080243 0.084685 0.066397 0.079656 0.034892 0.087927 0.072491 0.084544 0.084293 0.102969 0.094334 0.091431 0.074723 0.084017 0.077757 0.084003 0.091811 0.080644 0.114375 0.070439 0.080570 0.124734 0.091822 0.088284 0.094108 0.060010 0.103469 0.081434 0.080398 0.076068 0.091060 0.080893
qa: -0.3451 -0.2736 -0.4036 -0.1536 -0.2573 -0.1604 0.3598 0.0650 -0.1188 -0.3128 -0.2914 -0.2785 -0.1015 -0.1220 -0.1349 0.0497 -0.2686 -0.1657 0.4141 0.1418 -0.2591 -0.2286 0.0791 0.0713 0.0802 0.0847 0.0664 0.0797 0.0349 0.0879 0.0725 0.0845 0.0843 0.1030 0.0943 0.0914 0.0747 0.0840 0.0778 0.0840 0.0918 0.0806 0.1144 0.0704 0.0806 0.1247 0.0918 0.0883 0.0941 0.0600 0.1035 0.0814 0.0804 0.0761 0.0911 0.0809
va: 1.9959 2.1355 2.0948 3.8556 3.8599 3.8897 3.8261 3.7876 3.9219 3.9339 3.9110 3.9485 3.8677 3.9573 3.9491 3.6582 3.9238 3.8182 4.2254 3.8582 3.9089 3.9277 1.0205 1.0138 1.0027 1.0162 1.0133 1.0097 1.0221 1.0090 1.0179 1.0041 1.0095 1.0100 1.0139 1.0100 1.0067 1.0085 1.0041 1.0072 1.0133 0.9857 0.9941 0.9801 1.0286 1.0393 0.9977 0.9974 1.0372 1.0243 1.0172 1.0085 1.0092 1.0082 1.0111 1.0095
dispcorr: -0.024024415 hartree
energy: -970.293392653166
dipole: -17.83428 17.58358 -0.25070 10.57269 -10.65569 -0.08300 6.27330 -5.47746 0.79584
magnitude: 0.83851 au
magnitude: 2.13133 debye
