program: Orca
programVersion: 5.0.2
elementType: O O O C C C C C C C C C C C C C C C C C C C H H H H H H H H H H H H H H H H H H H H H H H H H H H H H H H H H H
charge: 0
multiplicity: 1
keywords: wb97x-d3
keywords: def2-TZVPP
keywords: def2/J RIJCOSX
keywords: DEFGRID2
keywords: scfconv7
keywords: smallprint printgap noloewdin
keywords: NOSOSCF
formula: C19H34O3
InChI: InChI=1/C19H34O3/c1-15(2)22-18(20)14-17(4)11-8-10-16(3)12-9-13-19(5,6)21-7/h8,11,14-16H,9-10,12-13H2,1-7H3
56 atoms
O  -3.563478 3.222014 1.306114
O  4.354782 -0.34657 0.309133
O  4.093659 -1.62339 -1.509527
C  -3.025054 0.53194 0.141477
C  -2.671781 1.857582 -0.520703
C  -3.299446 -0.556793 -0.888979
C  -2.452054 3.036559 0.441522
C  -3.602244 -1.943856 -0.313968
C  -2.440221 -2.501965 0.523772
C  -2.153336 4.299726 -0.3688
C  -1.282278 2.761297 1.381733
C  -4.894721 -1.968459 0.495475
C  -1.147883 -2.534233 -0.219247
C  -4.79091 3.549715 0.724099
C  -0.034261 -1.902894 0.161808
C  1.240378 -1.918298 -0.552544
C  1.301577 -2.678162 -1.840714
C  2.265157 -1.24372 0.004561
C  3.638168 -1.122551 -0.51146
C  5.729415 -0.090703 -0.01257
C  6.093792 1.200815 0.692787
C  6.605565 -1.252476 0.423339
H  -3.8914 0.663963 0.794179
H  -2.200964 0.222085 0.788872
H  -3.449976 2.117395 -1.24746
H  -1.759559 1.732135 -1.112961
H  -2.438204 -0.630687 -1.560787
H  -4.142504 -0.252449 -1.518748
H  -3.736746 -2.616744 -1.169635
H  -2.700494 -3.521745 0.82924
H  -2.32966 -1.928787 1.448381
H  -1.212008 4.18768 -0.907988
H  -2.062155 5.169554 0.283791
H  -2.922405 4.512494 -1.113294
H  -1.494835 1.927898 2.050771
H  -0.379927 2.522608 0.817853
H  -1.072478 3.63415 2.001175
H  -5.734253 -1.586415 -0.087266
H  -4.818226 -1.362239 1.399573
H  -5.145772 -2.983604 0.806968
H  -1.149556 -3.111877 -1.139659
H  -4.778627 4.510373 0.196509
H  -5.515026 3.628707 1.534891
H  -5.159312 2.788801 0.025427
H  -0.057135 -1.328446 1.084134
H  0.557692 -2.289179 -2.538699
H  2.274828 -2.626427 -2.311506
H  1.057617 -3.728359 -1.669477
H  2.085371 -0.726541 0.939981
H  5.823054 0.04409 -1.09356
H  5.456548 2.024041 0.370557
H  6.003171 1.101509 1.775228
H  7.125717 1.469553 0.466871
H  6.518339 -1.426764 1.496768
H  7.650604 -1.02993 0.204913
H  6.347815 -2.170239 -0.10215
totalener: -970.26910301 hartree
nucrepener: 1836.59064150 hartree
electener: -2806.85974450 hartree
oneelecener: -4965.15104622 hartree
twoeener: 2158.29130172 hartree
kineticenergy: 965.64936873 hartree
xcener: -96.765391096637 hartree
chargesum: -0.0000000
charge: -0.348532 -0.272974 -0.404903 -0.153212 -0.273447 -0.137732 0.383428 0.063019 -0.159971 -0.316743 -0.300957 -0.306524 -0.112557 -0.126941 -0.101580 0.038542 -0.267134 -0.166640 0.414144 0.142946 -0.228932 -0.259413 0.091956 0.054126 0.078018 0.086481 0.077246 0.079829 0.054470 0.092981 0.074718 0.088058 0.102917 0.085204 0.089591 0.079237 0.093765 0.089389 0.080076 0.087670 0.101501 0.081052 0.115706 0.070502 0.071799 0.087662 0.124806 0.090583 0.094172 0.058751 0.090160 0.081595 0.075933 0.081798 0.079592 0.104766
qa: -0.3485 -0.2730 -0.4049 -0.1532 -0.2734 -0.1377 0.3834 0.0630 -0.1600 -0.3167 -0.3010 -0.3065 -0.1126 -0.1269 -0.1016 0.0385 -0.2671 -0.1666 0.4141 0.1429 -0.2289 -0.2594 0.0920 0.0541 0.0780 0.0865 0.0772 0.0798 0.0545 0.0930 0.0747 0.0881 0.1029 0.0852 0.0896 0.0792 0.0938 0.0894 0.0801 0.0877 0.1015 0.0811 0.1157 0.0705 0.0718 0.0877 0.1248 0.0906 0.0942 0.0588 0.0902 0.0816 0.0759 0.0818 0.0796 0.1048
va: 1.9891 2.1357 2.0927 3.8463 3.8890 3.8525 3.7979 3.8035 3.9400 3.9291 3.9134 3.9613 3.8596 3.9608 3.9374 3.6788 3.9206 3.8188 4.2234 3.8570 3.9279 3.9065 1.0178 1.0149 1.0042 1.0165 1.0135 1.0112 1.0107 1.0086 1.0063 1.0097 1.0088 1.0018 1.0103 1.0070 1.0135 1.0054 1.0000 1.0066 1.0079 0.9854 0.9932 0.9797 1.0301 0.9982 1.0402 0.9977 1.0375 1.0240 1.0113 1.0096 1.0083 1.0084 1.0092 1.0177
dispcorr: -0.025258037 hartree
energy: -970.294361042499
dipole: -16.28357 15.73438 -0.54920 8.47519 -8.29937 0.17581 1.57655 -1.60437 -0.02782
magnitude: 0.57732 au
magnitude: 1.46743 debye
