program: Orca
programVersion: 5.0.2
elementType: O O O C C C C C C C C C C C C C C C C C C C H H H H H H H H H H H H H H H H H H H H H H H H H H H H H H H H H H
charge: 0
multiplicity: 1
keywords: wb97x-d3
keywords: def2-TZVPP
keywords: def2/J RIJCOSX
keywords: DEFGRID2
keywords: scfconv7
keywords: smallprint printgap noloewdin
keywords: NOSOSCF
formula: C19H34O3
InChI: InChI=1/C19H34O3/c1-15(2)22-18(20)14-17(4)11-8-10-16(3)12-9-13-19(5,6)21-7/h8,11,14-16H,9-10,12-13H2,1-7H3
56 atoms
O  -3.125679 3.578927 -0.966194
O  4.605222 -1.194412 0.709169
O  4.233831 -1.275734 -1.497725
C  -3.54724 0.857396 0.204837
C  -3.034977 2.075284 0.966048
C  -2.836419 -0.419971 0.636574
C  -3.468835 3.438981 0.405152
C  -3.307861 -1.681611 -0.087912
C  -2.299074 -2.82968 0.096936
C  -2.844954 4.552428 1.250241
C  -4.986988 3.581168 0.432421
C  -4.693191 -2.120049 0.372715
C  -1.014741 -2.577268 -0.617318
C  -1.774356 3.474148 -1.310994
C  0.160857 -2.35844 -0.023357
C  1.413496 -2.040421 -0.705339
C  1.398742 -2.005669 -2.201813
C  2.484033 -1.784145 0.071571
C  3.835862 -1.401312 -0.365863
C  5.964835 -0.780135 0.513029
C  6.029126 0.717652 0.268708
C  6.720055 -1.192494 1.7612
H  -3.400548 1.000289 -0.869598
H  -4.626166 0.75947 0.351293
H  -1.940647 2.035064 1.013147
H  -3.364346 2.017022 2.008473
H  -2.953073 -0.566144 1.717566
H  -1.763422 -0.287353 0.466835
H  -3.36189 -1.45678 -1.160967
H  -2.744168 -3.753892 -0.286873
H  -2.119449 -2.990088 1.164657
H  -3.237743 4.521544 2.267295
H  -3.076677 5.533438 0.832759
H  -1.759833 4.463517 1.325921
H  -5.468994 2.851464 -0.218094
H  -5.369166 3.439889 1.444034
H  -5.287239 4.57389 0.094763
H  -5.433497 -1.330216 0.24562
H  -4.682921 -2.395131 1.429928
H  -5.043625 -2.986585 -0.190012
H  -1.084303 -2.5377 -1.700617
H  -1.139426 4.216737 -0.81445
H  -1.706663 3.64903 -2.384598
H  -1.350164 2.482737 -1.110251
H  0.204901 -2.394461 1.061771
H  1.065763 -2.967677 -2.595502
H  0.686905 -1.255774 -2.552725
H  2.369386 -1.778883 -2.624163
H  2.357234 -1.843017 1.146333
H  6.376358 -1.304511 -0.353377
H  5.491347 1.000992 -0.634564
H  5.611683 1.269338 1.11236
H  7.066963 1.029514 0.146165
H  6.328317 -0.691043 2.647248
H  7.772166 -0.924842 1.663263
H  6.662943 -2.268672 1.923677
totalener: -970.26952358 hartree
nucrepener: 1800.90436967 hartree
electener: -2771.17389325 hartree
oneelecener: -4893.72694107 hartree
twoeener: 2122.55304781 hartree
kineticenergy: 965.64327659 hartree
xcener: -96.761517420417 hartree
chargesum: -0.0000000
charge: -0.345525 -0.273830 -0.403885 -0.153432 -0.256987 -0.159177 0.361724 0.064011 -0.118349 -0.313215 -0.292510 -0.278813 -0.103762 -0.122705 -0.131936 0.049962 -0.269043 -0.165288 0.414568 0.142434 -0.258559 -0.228607 0.078892 0.071351 0.080092 0.084583 0.066140 0.079627 0.034673 0.088228 0.071991 0.084691 0.103182 0.084442 0.091333 0.075084 0.094080 0.084115 0.077769 0.084091 0.091926 0.081107 0.114612 0.070188 0.079495 0.092146 0.087968 0.124750 0.094060 0.059703 0.103004 0.081207 0.080467 0.080794 0.076230 0.090899
qa: -0.3455 -0.2738 -0.4039 -0.1534 -0.2570 -0.1592 0.3617 0.0640 -0.1183 -0.3132 -0.2925 -0.2788 -0.1038 -0.1227 -0.1319 0.0500 -0.2690 -0.1653 0.4146 0.1424 -0.2586 -0.2286 0.0789 0.0714 0.0801 0.0846 0.0661 0.0796 0.0347 0.0882 0.0720 0.0847 0.1032 0.0844 0.0913 0.0751 0.0941 0.0841 0.0778 0.0841 0.0919 0.0811 0.1146 0.0702 0.0795 0.0921 0.0880 0.1248 0.0941 0.0597 0.1030 0.0812 0.0805 0.0808 0.0762 0.0909
va: 1.9953 2.1353 2.0944 3.8551 3.8618 3.8858 3.8222 3.7898 3.9211 3.9333 3.9112 3.9486 3.8704 3.9578 3.9487 3.6593 3.9237 3.8177 4.2248 3.8577 3.9098 3.9276 1.0203 1.0139 1.0030 1.0163 1.0133 1.0104 1.0221 1.0088 1.0181 1.0094 1.0099 1.0038 1.0102 1.0066 1.0135 1.0085 1.0042 1.0072 1.0134 0.9856 0.9940 0.9801 1.0291 0.9976 0.9974 1.0395 1.0373 1.0244 1.0173 1.0084 1.0092 1.0095 1.0082 1.0112
dispcorr: -0.023989101 hartree
energy: -970.293512684078
dipole: -17.93879 17.69790 -0.24089 10.54533 -10.63393 -0.08860 6.28288 -5.49088 0.79200
magnitude: 0.83256 au
magnitude: 2.11619 debye
