program: Orca
programVersion: 5.0.2
elementType: O O O C C C C C C C C C C C C C C C C C C C H H H H H H H H H H H H H H H H H H H H H H H H H H H H H H H H H H
charge: 0
multiplicity: 1
keywords: wb97x-d3
keywords: def2-TZVPP
keywords: def2/J RIJCOSX
keywords: DEFGRID2
keywords: scfconv7
keywords: smallprint printgap noloewdin
keywords: NOSOSCF
formula: C19H34O3
InChI: InChI=1/C19H34O3/c1-15(2)22-18(20)14-17(4)11-8-10-16(3)12-9-13-19(5,6)21-7/h8,11,14-16H,9-10,12-13H2,1-7H3
56 atoms
O  -4.983146 3.291553 0.982215
O  5.117932 -1.2531 0.545027
O  4.620031 -1.404097 -1.631546
C  -3.551915 0.941763 0.008135
C  -2.975702 2.330439 0.260406
C  -2.554622 -0.148322 0.385021
C  -3.935997 3.506167 0.047809
C  -2.995379 -1.569202 0.036194
C  -1.884265 -2.580953 0.360239
C  -4.457683 3.53034 -1.390787
C  -3.186684 4.806823 0.346327
C  -4.28187 -1.964586 0.752994
C  -0.638139 -2.365985 -0.4305
C  -6.033833 4.211865 1.006857
C  0.566485 -2.125289 0.093093
C  1.797084 -1.9058 -0.663858
C  1.706594 -1.939038 -2.157754
C  2.921036 -1.685401 0.045964
C  4.27492 -1.44171 -0.476599
C  6.498535 -0.990702 0.255272
C  7.053075 -0.253348 1.4581
C  7.239821 -2.287786 -0.018309
H  -3.818689 0.829292 -1.047965
H  -4.475896 0.826834 0.576763
H  -2.101486 2.480848 -0.380995
H  -2.606063 2.379413 1.290401
H  -2.349236 -0.095493 1.461416
H  -1.599226 0.059056 -0.107687
H  -3.180551 -1.612796 -1.045236
H  -2.261984 -3.588551 0.151734
H  -1.662596 -2.550537 1.431867
H  -5.099595 2.674531 -1.601775
H  -3.624949 3.504684 -2.094971
H  -5.027412 4.435535 -1.607323
H  -2.829677 4.82385 1.377135
H  -2.320467 4.90496 -0.308945
H  -3.806139 5.6910 0.1877
H  -4.162911 -1.892915 1.83677
H  -4.566369 -2.992019 0.519735
H  -5.118501 -1.325574 0.472365
H  -0.755919 -2.408247 -1.509939
H  -6.721258 3.888159 1.788295
H  -6.596524 4.252902 0.066966
H  -5.713522 5.231434 1.250873
H  0.658996 -2.083463 1.174817
H  0.995708 -1.187348 -2.506105
H  2.659488 -1.758778 -2.638845
H  1.330105 -2.908849 -2.48893
H  2.84673 -1.684052 1.127265
H  6.561313 -0.348417 -0.627081
H  7.004721 -0.867082 2.358615
H  8.097826 0.004944 1.285026
H  6.507238 0.671292 1.644878
H  7.177901 -2.961969 0.837327
H  8.294245 -2.079889 -0.204015
H  6.845508 -2.798586 -0.895055
totalener: -970.26985449 hartree
nucrepener: 1759.45078193 hartree
electener: -2729.72063642 hartree
oneelecener: -4811.04803845 hartree
twoeener: 2081.32740203 hartree
kineticenergy: 965.64456514 hartree
xcener: -96.762065176170 hartree
chargesum: -0.0000000
charge: -0.332582 -0.274005 -0.405351 -0.114436 -0.156180 -0.173047 0.317657 0.074950 -0.127504 -0.363402 -0.313653 -0.292059 -0.127696 -0.122552 -0.094407 0.041468 -0.267452 -0.164258 0.415009 0.143428 -0.228718 -0.259317 0.057877 0.081916 0.063914 0.075280 0.062438 0.078060 0.033298 0.089067 0.070857 0.102965 0.092926 0.092086 0.099908 0.086351 0.083822 0.082117 0.081709 0.088007 0.096798 0.109281 0.078381 0.076712 0.072671 0.087143 0.124756 0.090391 0.093811 0.058929 0.081172 0.075928 0.090257 0.081395 0.079516 0.104367
qa: -0.3326 -0.2740 -0.4054 -0.1144 -0.1562 -0.1730 0.3177 0.0749 -0.1275 -0.3634 -0.3137 -0.2921 -0.1277 -0.1226 -0.0944 0.0415 -0.2675 -0.1643 0.4150 0.1434 -0.2287 -0.2593 0.0579 0.0819 0.0639 0.0753 0.0624 0.0781 0.0333 0.0891 0.0709 0.1030 0.0929 0.0921 0.0999 0.0864 0.0838 0.0821 0.0817 0.0880 0.0968 0.1093 0.0784 0.0767 0.0727 0.0871 0.1248 0.0904 0.0938 0.0589 0.0812 0.0759 0.0903 0.0814 0.0795 0.1044
va: 2.0140 2.1356 2.0926 3.8429 3.8209 3.8880 3.8617 3.7847 3.9286 3.9429 3.9228 3.9595 3.8912 3.9611 3.9454 3.6748 3.9215 3.8199 4.2240 3.8568 3.9279 3.9076 1.0079 1.0373 1.0189 1.0237 1.0160 1.0115 1.0212 1.0084 1.0180 1.0001 1.0068 1.0024 1.0103 1.0095 1.0058 1.0028 1.0078 1.0056 1.0111 0.9960 0.9810 0.9831 1.0315 0.9979 1.0400 0.9977 1.0373 1.0245 1.0095 1.0081 1.0114 1.0087 1.0091 1.0174
dispcorr: -0.023324970 hartree
energy: -970.293179459171
dipole: -20.14508 19.60118 -0.54390 10.95929 -10.60299 0.35630 1.75198 -1.54586 0.20611
magnitude: 0.68210 au
magnitude: 1.73375 debye
