program: Orca
programVersion: 5.0.2
elementType: O O O C C C C C C C C C C C C C C C C C C C H H H H H H H H H H H H H H H H H H H H H H H H H H H H H H H H H H
charge: 0
multiplicity: 1
keywords: wb97x-d3
keywords: def2-TZVPP
keywords: def2/J RIJCOSX
keywords: DEFGRID2
keywords: scfconv7
keywords: smallprint printgap noloewdin
keywords: NOSOSCF
formula: C19H34O3
InChI: InChI=1/C19H34O3/c1-15(2)22-18(20)14-17(4)11-8-10-16(3)12-9-13-19(5,6)21-7/h8,11,14-16H,9-10,12-13H2,1-7H3
56 atoms
O  -3.267604 3.618006 -0.964331
O  4.665516 -1.242192 0.721111
O  4.300973 -1.363272 -1.484188
C  -3.564973 0.874072 0.18928
C  -3.077639 2.10246 0.949238
C  -2.823098 -0.387785 0.613768
C  -3.576346 3.453443 0.412437
C  -3.279983 -1.660564 -0.100333
C  -2.261855 -2.796932 0.102344
C  -2.981281 4.583261 1.256346
C  -5.098235 3.534148 0.472746
C  -4.662579 -2.108764 0.35956
C  -0.975449 -2.544087 -0.608002
C  -1.919357 3.598805 -1.334305
C  0.199083 -2.326878 -0.011201
C  1.45811 -2.031661 -0.691723
C  1.446037 -2.001339 -2.188403
C  2.532272 -1.79347 0.085972
C  3.894719 -1.451531 -0.352134
C  6.038897 -0.878228 0.519818
C  6.154819 0.607829 0.22788
C  6.774323 -1.274253 1.785057
H  -3.429877 1.022923 -0.885865
H  -4.640069 0.751393 0.344046
H  -1.981778 2.102618 0.968024
H  -3.377809 2.02248 1.999036
H  -2.923146 -0.533221 1.696551
H  -1.75492 -0.236155 0.429955
H  -3.331561 -1.44733 -1.175961
H  -2.696804 -3.729382 -0.273575
H  -2.086419 -2.944755 1.172655
H  -1.892853 4.532899 1.317349
H  -3.359305 4.532458 2.27811
H  -3.253748 5.557849 0.848412
H  -5.444659 4.521361 0.164489
H  -5.564252 2.80084 -0.185032
H  -5.453862 3.354587 1.487897
H  -5.412849 -1.332088 0.21216
H  -4.656398 -2.363664 1.421876
H  -4.997385 -2.990498 -0.188934
H  -1.040217 -2.514296 -1.692027
H  -1.32617 4.386857 -0.856481
H  -1.883642 3.767472 -2.410547
H  -1.425687 2.640048 -1.133811
H  0.239236 -2.35587 1.074245
H  0.737461 -1.250061 -2.542605
H  2.418369 -1.780661 -2.610007
H  1.10996 -2.963336 -2.579876
H  2.401769 -1.841792 1.160864
H  6.437317 -1.443723 -0.326686
H  7.203625 0.881168 0.106647
H  5.635797 0.879114 -0.689842
H  5.747872 1.200123 1.048824
H  7.83501 -1.04426 1.684543
H  6.681432 -2.342007 1.982363
H  6.3954 -0.731542 2.652146
totalener: -970.26969678 hartree
nucrepener: 1795.02607015 hartree
electener: -2765.29576693 hartree
oneelecener: -4881.97769535 hartree
twoeener: 2116.68192842 hartree
kineticenergy: 965.64655906 hartree
xcener: -96.762231270546 hartree
chargesum: 0.0000000
charge: -0.345959 -0.273806 -0.403971 -0.148920 -0.259805 -0.161898 0.367008 0.067545 -0.118825 -0.315300 -0.294729 -0.280652 -0.106627 -0.124327 -0.128097 0.049414 -0.269464 -0.164918 0.414285 0.141918 -0.258813 -0.228639 0.078988 0.071019 0.079805 0.083849 0.064727 0.080027 0.034595 0.088596 0.072031 0.085076 0.085202 0.103587 0.093766 0.091157 0.075920 0.084545 0.078117 0.083998 0.092021 0.080901 0.114818 0.071227 0.078685 0.087895 0.124987 0.091962 0.094096 0.060187 0.080175 0.103313 0.081397 0.076027 0.090840 0.081047
qa: -0.3460 -0.2738 -0.4040 -0.1489 -0.2598 -0.1619 0.3670 0.0675 -0.1188 -0.3153 -0.2947 -0.2807 -0.1066 -0.1243 -0.1281 0.0494 -0.2695 -0.1649 0.4143 0.1419 -0.2588 -0.2286 0.0790 0.0710 0.0798 0.0838 0.0647 0.0800 0.0346 0.0886 0.0720 0.0851 0.0852 0.1036 0.0938 0.0912 0.0759 0.0845 0.0781 0.0840 0.0920 0.0809 0.1148 0.0712 0.0787 0.0879 0.1250 0.0920 0.0941 0.0602 0.0802 0.1033 0.0814 0.0760 0.0908 0.0810
va: 1.9944 2.1358 2.0940 3.8540 3.8663 3.8843 3.8146 3.7881 3.9197 3.9326 3.9121 3.9484 3.8725 3.9586 3.9490 3.6615 3.9237 3.8191 4.2249 3.8579 3.9084 3.9279 1.0208 1.0137 1.0032 1.0164 1.0133 1.0113 1.0221 1.0087 1.0182 1.0029 1.0095 1.0094 1.0132 1.0103 1.0064 1.0083 1.0040 1.0072 1.0134 0.9853 0.9937 0.9801 1.0295 0.9973 1.0396 0.9978 1.0372 1.0241 1.0092 1.0176 1.0085 1.0083 1.0112 1.0094
dispcorr: -0.023902656 hartree
energy: -970.293599439033
dipole: -18.15490 17.92051 -0.23439 10.71003 -10.76934 -0.05932 6.15465 -5.37350 0.78115
magnitude: 0.81771 au
magnitude: 2.07846 debye
