program: Orca
programVersion: 5.0.2
elementType: O O O C C C C C C C C C C C C C C C C C C C H H H H H H H H H H H H H H H H H H H H H H H H H H H H H H H H H H
charge: 0
multiplicity: 1
keywords: wb97x-d3
keywords: def2-TZVPP
keywords: def2/J RIJCOSX
keywords: DEFGRID2
keywords: scfconv7
keywords: smallprint printgap noloewdin
keywords: NOSOSCF
formula: C19H34O3
InChI: InChI=1/C19H34O3/c1-15(2)22-18(20)14-17(4)11-8-10-16(3)12-9-13-19(5,6)21-7/h8,11,14-16H,9-10,12-13H2,1-7H3
56 atoms
O  -6.225962 2.642493 -1.337132
O  5.810147 -1.948869 0.764399
O  5.373805 -1.801946 -1.426926
C  -3.904821 1.421649 0.094706
C  -5.178512 1.933487 0.757931
C  -3.338296 0.20695 0.82082
C  -5.929191 3.036631 -0.005676
C  -2.069545 -0.383136 0.201298
C  -0.856406 0.536627 0.415926
C  -5.059874 4.279581 -0.162594
C  -7.199042 3.407648 0.764571
C  -1.799282 -1.77435 0.762451
C  0.347323 0.102571 -0.350404
C  -7.055382 1.531507 -1.51389
C  1.495605 -0.301001 0.198963
C  2.679836 -0.751968 -0.529468
C  2.618842 -0.74339 -2.024976
C  3.735936 -1.147975 0.207528
C  5.027998 -1.656133 -0.280795
C  7.12604 -2.465247 0.520123
C  7.949177 -2.128669 1.748142
C  7.067161 -3.959873 0.257025
H  -3.162079 2.222958 0.061468
H  -4.106721 1.155293 -0.946641
H  -4.939598 2.316544 1.755257
H  -5.854595 1.088967 0.934006
H  -4.108486 -0.571704 0.839899
H  -3.143885 0.455499 1.871141
H  -2.236112 -0.476513 -0.879676
H  -0.626695 0.585571 1.485128
H  -1.115095 1.55419 0.105923
H  -5.624699 5.088285 -0.627982
H  -4.189715 4.083423 -0.78866
H  -4.708164 4.629957 0.808298
H  -7.826073 2.541272 0.981905
H  -6.941974 3.862057 1.721968
H  -7.797065 4.128041 0.203983
H  -2.632509 -2.448043 0.558305
H  -1.664805 -1.737476 1.846142
H  -0.90026 -2.219168 0.335598
H  0.24307 0.112239 -1.43186
H  -6.643724 0.608209 -1.088861
H  -7.159212 1.380438 -2.588146
H  -8.060897 1.670297 -1.100845
H  1.572416 -0.308631 1.28272
H  3.539431 -1.081532 -2.483068
H  1.805649 -1.385069 -2.369802
H  2.402213 0.264045 -2.385013
H  3.646752 -1.102981 1.286667
H  7.550268 -1.962507 -0.353048
H  7.977539 -1.053774 1.92572
H  7.549638 -2.612712 2.640288
H  8.975016 -2.471565 1.612591
H  6.488353 -4.187523 -0.636476
H  6.627455 -4.489224 1.103576
H  8.074479 -4.349681 0.106032
totalener: -970.26976961 hartree
nucrepener: 1729.54000132 hartree
electener: -2699.80977094 hartree
oneelecener: -4750.98338872 hartree
twoeener: 2051.17361778 hartree
kineticenergy: 965.64514259 hartree
xcener: -96.761949634801 hartree
chargesum: 0.0000000
charge: -0.346727 -0.273497 -0.404148 -0.126086 -0.266903 -0.167031 0.372560 0.081249 -0.123706 -0.296437 -0.315130 -0.291003 -0.142081 -0.125880 -0.093405 0.039673 -0.268590 -0.162689 0.413829 0.143378 -0.229225 -0.258485 0.068114 0.075932 0.084287 0.077849 0.067118 0.066860 0.037398 0.069251 0.094778 0.094466 0.090911 0.075754 0.085133 0.086731 0.103946 0.084126 0.075607 0.096089 0.097602 0.070307 0.115921 0.081032 0.072931 0.124193 0.088223 0.091112 0.093545 0.058528 0.090812 0.080739 0.076276 0.103481 0.081136 0.080147
qa: -0.3467 -0.2735 -0.4041 -0.1261 -0.2669 -0.1670 0.3726 0.0812 -0.1237 -0.2964 -0.3151 -0.2910 -0.1421 -0.1259 -0.0934 0.0397 -0.2686 -0.1627 0.4138 0.1434 -0.2292 -0.2585 0.0681 0.0759 0.0843 0.0778 0.0671 0.0669 0.0374 0.0693 0.0948 0.0945 0.0909 0.0758 0.0851 0.0867 0.1039 0.0841 0.0756 0.0961 0.0976 0.0703 0.1159 0.0810 0.0729 0.1242 0.0882 0.0911 0.0935 0.0585 0.0908 0.0807 0.0763 0.1035 0.0811 0.0801
va: 1.9916 2.1347 2.0945 3.8443 3.8741 3.8882 3.8060 3.7774 3.9256 3.9141 3.9301 3.9554 3.8998 3.9602 3.9615 3.6753 3.9238 3.8170 4.2247 3.8582 3.9272 3.9092 1.0160 1.0218 1.0163 1.0038 1.0152 1.0116 1.0226 1.0201 1.0090 1.0128 1.0107 1.0065 1.0019 1.0097 1.0089 1.0074 1.0056 1.0041 1.0116 0.9795 0.9936 0.9849 1.0320 1.0397 0.9976 0.9976 1.0374 1.0247 1.0112 1.0095 1.0081 1.0173 1.0087 1.0091
dispcorr: -0.023540563 hartree
energy: -970.293310177626
dipole: -25.24401 24.52986 -0.71415 4.80681 -4.84991 -0.04310 5.76536 -4.92114 0.84422
magnitude: 1.10661 au
magnitude: 2.81277 debye
