program: Orca
programVersion: 5.0.2
elementType: O O O C C C C C C C C C C C C C C C C C C C H H H H H H H H H H H H H H H H H H H H H H H H H H H H H H H H H H
charge: 0
multiplicity: 1
keywords: wb97x-d3
keywords: def2-TZVPP
keywords: def2/J RIJCOSX
keywords: DEFGRID2
keywords: scfconv7
keywords: smallprint printgap noloewdin
keywords: NOSOSCF
formula: C19H34O3
InChI: InChI=1/C19H34O3/c1-15(2)22-18(20)14-17(4)11-8-10-16(3)12-9-13-19(5,6)21-7/h8,11,14-16H,9-10,12-13H2,1-7H3
56 atoms
O  -0.601049 1.919316 -0.230462
O  3.883681 -0.651845 0.605044
O  3.172274 0.047368 -1.396495
C  -3.069275 0.375778 0.113761
C  -2.595317 1.568042 0.937124
C  -3.616436 -0.75027 0.987026
C  -1.773131 2.612235 0.170295
C  -4.009709 -2.022633 0.222707
C  -2.824082 -2.9900 0.040182
C  -1.434436 3.76285 1.12089
C  -2.554507 3.148375 -1.031377
C  -5.147315 -2.756058 0.926449
C  -1.655944 -2.391277 -0.664029
C  0.354031 2.618892 -0.977489
C  -0.45762 -2.189519 -0.110409
C  0.658969 -1.491434 -0.741775
C  0.459554 -0.993491 -2.138375
C  1.769671 -1.313788 0.000706
C  2.978755 -0.570086 -0.37644
C  5.116899 0.066367 0.46144
C  4.916519 1.536713 0.788254
C  6.106328 -0.597995 1.398339
H  -2.23743 0.009242 -0.485668
H  -3.849544 0.68459 -0.589019
H  -1.976234 1.206127 1.764786
H  -3.456082 2.065769 1.39547
H  -4.489844 -0.374315 1.530498
H  -2.878868 -1.007679 1.756024
H  -4.365131 -1.730823 -0.77352
H  -3.178183 -3.859946 -0.524221
H  -2.516203 -3.361329 1.02296
H  -2.346416 4.214918 1.512508
H  -0.87184 4.557879 0.629254
H  -0.846201 3.406932 1.968052
H  -2.714551 2.376136 -1.784701
H  -3.533136 3.512396 -0.71472
H  -2.046074 3.984178 -1.51475
H  -6.036232 -2.12847 0.999954
H  -4.861021 -3.040121 1.941628
H  -5.429383 -3.667637 0.396892
H  -1.836981 -2.06846 -1.685123
H  1.171344 1.927378 -1.179162
H  0.770892 3.481131 -0.444033
H  -0.027438 2.97356 -1.942206
H  -0.30027 -2.516317 0.913681
H  -0.310887 -0.219464 -2.140091
H  1.361043 -0.574715 -2.566753
H  0.110888 -1.801359 -2.78353
H  1.785605 -1.729961 1.001115
H  5.468341 -0.029517 -0.569327
H  4.527581 1.661997 1.799914
H  5.870422 2.062206 0.729815
H  4.232751 2.016197 0.090113
H  6.227094 -1.65565 1.165225
H  5.789484 -0.510567 2.438461
H  7.082165 -0.121535 1.305025
totalener: -970.26740062 hartree
nucrepener: 1930.97340562 hartree
electener: -2901.24080624 hartree
oneelecener: -5154.46384836 hartree
twoeener: 2253.22304211 hartree
kineticenergy: 965.64265642 hartree
xcener: -96.763721772581 hartree
chargesum: 0.0000000
charge: -0.326408 -0.272089 -0.418276 -0.079557 -0.168492 -0.174214 0.315004 0.060646 -0.143365 -0.316534 -0.362066 -0.277811 -0.103443 -0.134082 -0.108821 0.067992 -0.305596 -0.146078 0.406674 0.145118 -0.257871 -0.231485 0.047670 0.065390 0.075897 0.067371 0.074051 0.064836 0.037971 0.085191 0.070162 0.083479 0.084269 0.100830 0.099944 0.093123 0.092858 0.082060 0.083317 0.080762 0.105071 0.112031 0.085292 0.084436 0.069711 0.098086 0.126334 0.101070 0.089214 0.059811 0.082820 0.079637 0.099874 0.090924 0.081300 0.075962
qa: -0.3264 -0.2721 -0.4183 -0.0796 -0.1685 -0.1742 0.3150 0.0606 -0.1434 -0.3165 -0.3621 -0.2778 -0.1034 -0.1341 -0.1088 0.0680 -0.3056 -0.1461 0.4067 0.1451 -0.2579 -0.2315 0.0477 0.0654 0.0759 0.0674 0.0741 0.0648 0.0380 0.0852 0.0702 0.0835 0.0843 0.1008 0.0999 0.0931 0.0929 0.0821 0.0833 0.0808 0.1051 0.1120 0.0853 0.0844 0.0697 0.0981 0.1263 0.1011 0.0892 0.0598 0.0828 0.0796 0.0999 0.0909 0.0813 0.0760
va: 2.0026 2.1430 2.0646 3.8236 3.8271 3.9247 3.8748 3.7694 3.9587 3.9234 3.9505 3.9467 3.8789 3.9358 3.9398 3.6506 3.9078 3.8223 4.2064 3.8561 3.9062 3.9329 1.0534 1.0121 1.0252 1.0165 1.0066 1.0135 1.0209 1.0091 1.0147 1.0100 1.0063 1.0097 0.9995 1.0063 1.0040 1.0064 1.0022 1.0075 1.0049 1.0045 0.9904 0.9822 1.0306 0.9941 1.0350 1.0020 1.0377 1.0230 1.0091 1.0091 1.0175 1.0114 1.0089 1.0079
dispcorr: -0.028272974 hartree
energy: -970.295673597698
dipole: -15.26469 14.72323 -0.54146 8.92294 -8.72670 0.19624 4.16641 -3.80361 0.36280
magnitude: 0.68067 au
magnitude: 1.73013 debye
