program: Orca
programVersion: 5.0.2
elementType: O O O C C C C C C C C C C C C C C C C C C C H H H H H H H H H H H H H H H H H H H H H H H H H H H H H H H H H H
charge: 0
multiplicity: 1
keywords: wb97x-d3
keywords: def2-TZVPP
keywords: def2/J RIJCOSX
keywords: DEFGRID2
keywords: scfconv7
keywords: smallprint printgap noloewdin
keywords: NOSOSCF
formula: C19H34O3
InChI: InChI=1/C19H34O3/c1-15(2)22-18(20)14-17(4)11-8-10-16(3)12-9-13-19(5,6)21-7/h8,11,14-16H,9-10,12-13H2,1-7H3
56 atoms
O  -0.721324 1.92244 -0.271434
O  3.950204 -0.70221 0.59518
O  3.19592 0.095941 -1.353901
C  -3.161349 0.364155 0.043535
C  -2.741348 1.584918 0.854737
C  -3.703824 -0.755804 0.927498
C  -1.899485 2.621313 0.099262
C  -4.018075 -2.063469 0.18723
C  -2.787527 -2.982411 0.06928
C  -1.586635 3.780858 1.047834
C  -2.647981 3.145419 -1.12826
C  -5.145434 -2.824265 0.878039
C  -1.625203 -2.365232 -0.629608
C  0.302545 2.641644 -0.899243
C  -0.433731 -2.141386 -0.069824
C  0.683955 -1.447588 -0.704275
C  0.485729 -0.955318 -2.103052
C  1.799927 -1.280853 0.032963
C  3.018382 -0.557165 -0.353402
C  5.198621 -0.01309 0.439285
C  5.056251 1.436616 0.87088
C  6.209989 -0.765361 1.280888
H  -2.304234 0.005356 -0.523829
H  -3.928609 0.638438 -0.687194
H  -2.154967 1.253325 1.717904
H  -3.628111 2.081643 1.261123
H  -4.611353 -0.397673 1.42506
H  -2.988948 -0.963588 1.732058
H  -4.354094 -1.814542 -0.827257
H  -3.08921 -3.886693 -0.471679
H  -2.489548 -3.306187 1.071719
H  -1.007524 3.437082 1.906492
H  -2.510406 4.222335 1.423694
H  -1.027347 4.580933 0.560553
H  -2.811971 2.357902 -1.864337
H  -3.622889 3.540967 -0.839287
H  -2.110312 3.955969 -1.622863
H  -6.06183 -2.233622 0.90469
H  -4.879719 -3.064862 1.909908
H  -5.371556 -3.762793 0.369133
H  -1.802009 -2.059987 -1.656875
H  1.092973 1.930806 -1.138164
H  0.736434 3.416973 -0.257731
H  -0.012398 3.117463 -1.835367
H  -0.279794 -2.453541 0.959287
H  0.145125 -1.768195 -2.746393
H  -0.290177 -0.186931 -2.110124
H  1.385871 -0.532294 -2.530381
H  1.818227 -1.70136 1.031559
H  5.498796 -0.049725 -0.611097
H  4.34585 1.974823 0.245766
H  4.728951 1.504148 1.909437
H  6.01801 1.944528 0.789913
H  6.294722 -1.805408 0.966812
H  5.940648 -0.747274 2.337758
H  7.192449 -0.304441 1.178397
totalener: -970.26762261 hartree
nucrepener: 1923.51197464 hartree
electener: -2893.77959725 hartree
oneelecener: -5139.54759977 hartree
twoeener: 2245.76800252 hartree
kineticenergy: 965.64415551 hartree
xcener: -96.763910918483 hartree
chargesum: 0.0000000
charge: -0.327231 -0.273084 -0.417757 -0.085523 -0.167120 -0.172782 0.313079 0.059901 -0.140901 -0.322741 -0.353315 -0.277030 -0.107762 -0.126288 -0.104283 0.067026 -0.305691 -0.147648 0.407149 0.143799 -0.257629 -0.229452 0.052355 0.065793 0.074532 0.068069 0.073802 0.064212 0.037838 0.085433 0.069241 0.101860 0.084577 0.086806 0.099732 0.091387 0.090464 0.081914 0.083303 0.080500 0.104944 0.107838 0.085619 0.082119 0.069391 0.100425 0.098405 0.125491 0.089701 0.059733 0.100004 0.082327 0.079747 0.090917 0.081064 0.075740
qa: -0.3272 -0.2731 -0.4178 -0.0855 -0.1671 -0.1728 0.3131 0.0599 -0.1409 -0.3227 -0.3533 -0.2770 -0.1078 -0.1263 -0.1043 0.0670 -0.3057 -0.1476 0.4071 0.1438 -0.2576 -0.2295 0.0524 0.0658 0.0745 0.0681 0.0738 0.0642 0.0378 0.0854 0.0692 0.1019 0.0846 0.0868 0.0997 0.0914 0.0905 0.0819 0.0833 0.0805 0.1049 0.1078 0.0856 0.0821 0.0694 0.1004 0.0984 0.1255 0.0897 0.0597 0.1000 0.0823 0.0797 0.0909 0.0811 0.0757
va: 2.0039 2.1429 2.0636 3.8296 3.8317 3.9257 3.8756 3.7741 3.9558 3.9213 3.9519 3.9464 3.8896 3.9369 3.9401 3.6538 3.9070 3.8217 4.2035 3.8576 3.9098 3.9312 1.0492 1.0119 1.0245 1.0168 1.0065 1.0135 1.0209 1.0084 1.0153 1.0081 1.0106 1.0037 1.0013 1.0062 1.0063 1.0065 1.0022 1.0076 1.0048 1.0065 0.9895 0.9832 1.0306 1.0019 0.9969 1.0348 1.0375 1.0240 1.0170 1.0089 1.0092 1.0114 1.0092 1.0079
dispcorr: -0.028017469 hartree
energy: -970.295640081533
dipole: -15.30368 14.79785 -0.50583 8.48396 -8.31753 0.16644 3.95785 -3.59029 0.36756
magnitude: 0.64704 au
magnitude: 1.64465 debye
