program: Orca
programVersion: 5.0.2
elementType: O O O C C C C C C C C C C C C C C C C C C C H H H H H H H H H H H H H H H H H H H H H H H H H H H H H H H H H H
charge: 0
multiplicity: 1
keywords: wb97x-d3
keywords: def2-TZVPP
keywords: def2/J RIJCOSX
keywords: DEFGRID2
keywords: scfconv7
keywords: smallprint printgap noloewdin
keywords: NOSOSCF
formula: C19H34O3
InChI: InChI=1/C19H34O3/c1-15(2)22-18(20)14-17(4)11-8-10-16(3)12-9-13-19(5,6)21-7/h8,11,14-16H,9-10,12-13H2,1-7H3
56 atoms
O  -0.699615 1.924146 -0.271351
O  3.93129 -0.69528 0.602739
O  3.19462 0.07536 -1.363737
C  -3.14123 0.365514 0.05648
C  -2.710127 1.581145 0.869527
C  -3.678368 -0.758028 0.939031
C  -1.875933 2.620711 0.109669
C  -4.015903 -2.055954 0.191577
C  -2.797399 -2.988006 0.051651
C  -1.556645 3.779045 1.057481
C  -2.635749 3.145923 -1.110606
C  -5.1441 -2.810476 0.887884
C  -1.633918 -2.372505 -0.646606
C  0.31473 2.643753 -0.914058
C  -0.441153 -2.155595 -0.086606
C  0.678063 -1.461209 -0.717743
C  0.482068 -0.964816 -2.115398
C  1.791379 -1.293842 0.023311
C  3.009406 -0.567069 -0.357869
C  5.178965 -0.003711 0.450985
C  5.024887 1.456859 0.840255
C  6.177546 -0.728882 1.331241
H  -2.290582 0.007335 -0.52165
H  -3.91497 0.645695 -0.665568
H  -2.114438 1.243853 1.724577
H  -3.592166 2.076484 1.28877
H  -4.57483 -0.396706 1.454688
H  -2.951792 -0.978748 1.730031
H  -4.360141 -1.794114 -0.816978
H  -3.113703 -3.881287 -0.498997
H  -2.495356 -3.328383 1.047372
H  -0.971806 3.434375 1.911825
H  -2.477548 4.220898 1.439715
H  -1.000208 4.579175 0.567227
H  -2.800465 2.361127 -1.849634
H  -3.611237 3.534235 -0.813437
H  -2.106573 3.962141 -1.605383
H  -6.053685 -2.210016 0.929295
H  -4.870316 -3.062858 1.914961
H  -5.386124 -3.742023 0.373318
H  -1.810405 -2.061535 -1.672308
H  -0.012039 3.112566 -1.849978
H  1.105609 1.934532 -1.156699
H  0.752296 3.425277 -0.282169
H  -0.287584 -2.474903 0.940364
H  1.383884 -0.544357 -2.541686
H  0.137962 -1.77455 -2.760809
H  -0.29076 -0.193121 -2.120525
H  1.806362 -1.714452 1.021975
H  5.498572 -0.067465 -0.592561
H  4.326542 1.976957 0.186884
H  4.677026 1.551753 1.870083
H  5.987427 1.964327 0.765049
H  6.270425 -1.777453 1.048747
H  5.889699 -0.681407 2.382492
H  7.160557 -0.268167 1.23308
totalener: -970.26755688 hartree
nucrepener: 1924.75696207 hartree
electener: -2895.02451896 hartree
oneelecener: -5142.03807071 hartree
twoeener: 2247.01355175 hartree
kineticenergy: 965.63713356 hartree
xcener: -96.762435412068 hartree
chargesum: 0.0000000
charge: -0.327075 -0.272741 -0.417762 -0.085037 -0.167364 -0.172433 0.313563 0.060094 -0.142253 -0.322218 -0.354496 -0.277403 -0.106336 -0.127082 -0.105478 0.067614 -0.305987 -0.147364 0.406923 0.144351 -0.258127 -0.230212 0.052081 0.065522 0.074794 0.067856 0.073935 0.064374 0.037940 0.085330 0.069522 0.101856 0.084501 0.086508 0.099829 0.091644 0.090641 0.081950 0.083347 0.080583 0.105198 0.082237 0.108107 0.085715 0.069414 0.125717 0.100339 0.098337 0.089570 0.059691 0.100284 0.082406 0.079675 0.090939 0.081174 0.075806
qa: -0.3271 -0.2727 -0.4178 -0.0850 -0.1674 -0.1724 0.3136 0.0601 -0.1423 -0.3222 -0.3545 -0.2774 -0.1063 -0.1271 -0.1055 0.0676 -0.3060 -0.1474 0.4069 0.1444 -0.2581 -0.2302 0.0521 0.0655 0.0748 0.0679 0.0739 0.0644 0.0379 0.0853 0.0695 0.1019 0.0845 0.0865 0.0998 0.0916 0.0906 0.0820 0.0833 0.0806 0.1052 0.0822 0.1081 0.0857 0.0694 0.1257 0.1003 0.0983 0.0896 0.0597 0.1003 0.0824 0.0797 0.0909 0.0812 0.0758
va: 2.0040 2.1430 2.0642 3.8287 3.8310 3.9245 3.8752 3.7723 3.9574 3.9215 3.9518 3.9465 3.8861 3.9372 3.9395 3.6519 3.9071 3.8217 4.2046 3.8572 3.9080 3.9317 1.0496 1.0119 1.0246 1.0167 1.0065 1.0136 1.0209 1.0086 1.0150 1.0082 1.0105 1.0039 1.0011 1.0062 1.0060 1.0065 1.0022 1.0076 1.0046 0.9831 1.0059 0.9895 1.0307 1.0348 1.0020 0.9965 1.0376 1.0235 1.0174 1.0089 1.0091 1.0114 1.0091 1.0079
dispcorr: -0.028049416 hartree
energy: -970.295606296795
dipole: -15.29241 14.77866 -0.51375 8.62110 -8.44437 0.17673 4.02739 -3.65744 0.36994
magnitude: 0.65729 au
magnitude: 1.67070 debye
