program: Orca
programVersion: 5.0.2
elementType: O O O C C C C C C C C C C C C C C C C C C C H H H H H H H H H H H H H H H H H H H H H H H H H H H H H H H H H H
charge: 0
multiplicity: 1
keywords: wb97x-d3
keywords: def2-TZVPP
keywords: def2/J RIJCOSX
keywords: DEFGRID2
keywords: scfconv7
keywords: smallprint printgap noloewdin
keywords: NOSOSCF
formula: C19H34O3
InChI: InChI=1/C19H34O3/c1-15(2)22-18(20)14-17(4)11-8-10-16(3)12-9-13-19(5,6)21-7/h8,11,14-16H,9-10,12-13H2,1-7H3
56 atoms
O  -1.17528 2.373973 0.437895
O  4.134321 -0.654297 -0.646617
O  3.303824 0.212489 1.242333
C  -3.283443 0.333449 -0.12686
C  -3.077401 1.621704 -0.913698
C  -3.795605 -0.800501 -1.010671
C  -2.416422 2.76782 -0.12849
C  -3.930258 -2.176877 -0.341963
C  -2.604516 -2.961392 -0.297365
C  -3.269784 3.170834 1.070923
C  -2.254644 3.978749 -1.050898
C  -4.602822 -2.109226 1.025913
C  -1.484864 -2.288383 0.421816
C  -0.146136 2.001823 -0.436375
C  -0.2894 -2.035765 -0.118555
C  0.80846 -1.329091 0.537356
C  0.561391 -0.796409 1.913968
C  1.950497 -1.184107 -0.164717
C  3.164152 -0.46718 0.254978
C  5.404016 -0.021709 -0.427929
C  6.237429 -0.827254 0.553345
C  6.06506 0.086076 -1.788222
H  -3.994592 0.508748 0.684094
H  -2.343149 0.049856 0.347087
H  -4.040967 1.980168 -1.291111
H  -2.482763 1.405686 -1.808623
H  -3.142227 -0.899519 -1.88466
H  -4.775233 -0.512824 -1.406974
H  -4.586786 -2.771585 -0.986331
H  -2.291224 -3.18851 -1.320104
H  -2.80395 -3.926752 0.183258
H  -4.283507 3.423278 0.757729
H  -2.844676 4.042536 1.569907
H  -3.332061 2.368812 1.806033
H  -3.232516 4.365023 -1.3411
H  -1.715302 4.782511 -0.547418
H  -1.722759 3.738107 -1.972813
H  -3.997849 -1.585147 1.76687
H  -4.798717 -3.11018 1.413532
H  -5.560285 -1.588804 0.967476
H  -1.678309 -1.993488 1.448412
H  0.130148 2.795845 -1.139394
H  -0.374976 1.099491 -1.016036
H  0.728821 1.783607 0.17591
H  -0.109096 -2.350551 -1.142886
H  1.44028 -0.340144 2.350873
H  -0.231323 -0.044393 1.885484
H  0.221687 -1.597107 2.573156
H  2.00362 -1.634176 -1.149402
H  5.237234 0.979579 -0.021814
H  6.400457 -1.841572 0.185937
H  7.213372 -0.357898 0.682583
H  5.765799 -0.881705 1.532817
H  7.030708 0.582463 -1.691854
H  5.458784 0.667444 -2.482563
H  6.237928 -0.898299 -2.225233
totalener: -970.26599562 hartree
nucrepener: 1913.86976802 hartree
electener: -2884.13576364 hartree
oneelecener: -5119.95429861 hartree
twoeener: 2235.81853498 hartree
kineticenergy: 965.63765835 hartree
xcener: -96.765837017479 hartree
chargesum: 0.0000000
charge: -0.345792 -0.273318 -0.408200 -0.100633 -0.268192 -0.181451 0.385167 0.065408 -0.139474 -0.298723 -0.324202 -0.303086 -0.121562 -0.128951 -0.104500 0.000805 -0.273387 -0.153051 0.418333 0.144171 -0.259026 -0.229978 0.082334 0.037198 0.081783 0.077800 0.067608 0.083349 0.052296 0.076158 0.091337 0.075544 0.094742 0.089713 0.086440 0.104155 0.085662 0.073330 0.091231 0.093030 0.110460 0.093114 0.071999 0.113821 0.073555 0.127071 0.104616 0.096516 0.092261 0.059422 0.081610 0.079670 0.104063 0.076098 0.089615 0.082042
qa: -0.3458 -0.2733 -0.4082 -0.1006 -0.2682 -0.1815 0.3852 0.0654 -0.1395 -0.2987 -0.3242 -0.3031 -0.1216 -0.1290 -0.1045 0.0008 -0.2734 -0.1531 0.4183 0.1442 -0.2590 -0.2300 0.0823 0.0372 0.0818 0.0778 0.0676 0.0833 0.0523 0.0762 0.0913 0.0755 0.0947 0.0897 0.0864 0.1042 0.0857 0.0733 0.0912 0.0930 0.1105 0.0931 0.0720 0.1138 0.0736 0.1271 0.1046 0.0965 0.0923 0.0594 0.0816 0.0797 0.1041 0.0761 0.0896 0.0820
va: 1.9913 2.1437 2.0745 3.8040 3.9058 3.9412 3.7872 3.7916 3.9442 3.9225 3.9320 3.9666 3.8725 3.9466 3.9010 3.6779 3.8944 3.7775 4.2002 3.8560 3.9064 3.9290 1.0050 1.0390 1.0170 1.0047 1.0129 1.0051 1.0112 1.0157 1.0062 1.0067 1.0126 1.0090 1.0094 1.0094 1.0019 0.9984 1.0087 1.0033 0.9976 0.9901 0.9734 1.0046 1.0310 1.0379 1.0032 0.9991 1.0384 1.0239 1.0087 1.0093 1.0181 1.0082 1.0111 1.0093
dispcorr: -0.028693084 hartree
energy: -970.294688700794
dipole: -15.35683 14.82558 -0.53125 4.81612 -5.20323 -0.38711 -3.00091 2.18162 -0.81929
magnitude: 1.05039 au
magnitude: 2.66989 debye
