program: Orca
programVersion: 5.0.2
elementType: O O O C C C C C C C C C C C C C C C C C C C H H H H H H H H H H H H H H H H H H H H H H H H H H H H H H H H H H
charge: 0
multiplicity: 1
keywords: wb97x-d3
keywords: def2-TZVPP
keywords: def2/J RIJCOSX
keywords: DEFGRID2
keywords: scfconv7
keywords: smallprint printgap noloewdin
keywords: NOSOSCF
formula: C19H34O3
InChI: InChI=1/C19H34O3/c1-15(2)22-18(20)14-17(4)11-8-10-16(3)12-9-13-19(5,6)21-7/h8,11,14-16H,9-10,12-13H2,1-7H3
56 atoms
O  -2.682695 3.228529 0.771316
O  4.199563 -0.822783 0.428848
O  3.537552 -0.291059 -1.642957
C  -2.934602 0.30935 1.14451
C  -2.807699 1.08721 -0.159348
C  -4.046115 -0.735824 1.126491
C  -1.95281 2.357815 -0.08154
C  -3.976161 -1.836959 0.064393
C  -2.689213 -2.679254 0.1432
C  -1.827939 2.953879 -1.485605
C  -0.561315 2.047208 0.473274
C  -5.198959 -2.741264 0.19996
C  -1.516108 -2.100378 -0.574063
C  -2.076577 4.429941 1.14593
C  -0.300435 -1.921094 -0.052241
C  0.852826 -1.36942 -0.758983
C  0.657028 -0.95238 -2.183251
C  2.00511 -1.266071 -0.067683
C  3.291638 -0.737349 -0.549339
C  5.528752 -0.342914 0.179509
C  5.588037 1.163501 0.362696
C  6.434896 -1.078542 1.147073
H  -3.149764 1.007403 1.956694
H  -1.981677 -0.163639 1.391815
H  -3.804209 1.374973 -0.512566
H  -2.383822 0.443125 -0.93504
H  -5.0038 -0.217061 1.009988
H  -4.089364 -1.217251 2.110234
H  -4.019131 -1.372667 -0.928309
H  -2.895197 -3.654774 -0.313607
H  -2.437791 -2.883952 1.188689
H  -1.315254 2.257963 -2.151482
H  -1.251311 3.88037 -1.494297
H  -2.81089 3.164622 -1.909744
H  -0.600779 1.762201 1.52534
H  -0.108636 1.21862 -0.072472
H  0.117738 2.896792 0.38218
H  -6.12479 -2.166627 0.152271
H  -5.19156 -3.27094 1.155306
H  -5.233877 -3.490544 -0.592315
H  -1.693635 -1.839475 -1.613695
H  -1.18289 4.289013 1.764298
H  -2.805017 4.98257 1.739268
H  -1.797517 5.062476 0.295081
H  -0.13929 -2.191181 0.987781
H  -0.138634 -0.206285 -2.24789
H  1.553364 -0.535727 -2.624253
H  0.339609 -1.805546 -2.785317
H  2.010478 -1.604482 0.961858
H  5.812061 -0.591814 -0.84652
H  6.606926 1.517071 0.20055
H  4.943599 1.680055 -0.346559
H  5.292714 1.44659 1.374158
H  6.178853 -0.85364 2.18324
H  7.470485 -0.778892 0.986101
H  6.37402 -2.157449 1.006144
totalener: -970.26627853 hartree
nucrepener: 1895.43998791 hartree
electener: -2865.70626644 hartree
oneelecener: -5082.91698448 hartree
twoeener: 2217.21071805 hartree
kineticenergy: 965.64712732 hartree
xcener: -96.766307998828 hartree
chargesum: -0.0000000
charge: -0.333351 -0.272066 -0.404935 -0.076015 -0.163320 -0.238314 0.305792 0.078129 -0.143069 -0.302141 -0.329378 -0.274627 -0.119770 -0.124216 -0.113724 -0.000224 -0.240706 -0.152305 0.420817 0.143700 -0.260383 -0.228774 0.092724 0.060816 0.085692 0.048418 0.076414 0.074131 0.041889 0.092478 0.077859 0.085461 0.084302 0.097640 0.101495 0.063557 0.097139 0.083387 0.082755 0.079841 0.099814 0.080439 0.110022 0.074865 0.081528 0.060610 0.128076 0.100939 0.093029 0.059227 0.081086 0.103235 0.081555 0.081089 0.076555 0.090814
qa: -0.3334 -0.2721 -0.4049 -0.0760 -0.1633 -0.2383 0.3058 0.0781 -0.1431 -0.3021 -0.3294 -0.2746 -0.1198 -0.1242 -0.1137 -0.0002 -0.2407 -0.1523 0.4208 0.1437 -0.2604 -0.2288 0.0927 0.0608 0.0857 0.0484 0.0764 0.0741 0.0419 0.0925 0.0779 0.0855 0.0843 0.0976 0.1015 0.0636 0.0971 0.0834 0.0828 0.0798 0.0998 0.0804 0.1100 0.0749 0.0815 0.0606 0.1281 0.1009 0.0930 0.0592 0.0811 0.1032 0.0816 0.0811 0.0766 0.0908
va: 2.0145 2.1382 2.0928 3.7861 3.7793 3.9764 3.9238 3.7158 3.9161 3.9297 3.9329 3.9435 3.8573 3.9611 3.8898 3.6596 3.8995 3.7983 4.2214 3.8550 3.9100 3.9276 1.0332 1.0129 1.0292 1.0151 1.0093 1.0113 1.0176 1.0034 1.0154 1.0028 1.0091 1.0105 0.9993 1.0291 1.0052 1.0079 1.0034 1.0069 1.0058 0.9814 0.9961 0.9838 1.0278 1.0009 1.0421 0.9992 1.0382 1.0246 1.0090 1.0170 1.0084 1.0094 1.0081 1.0112
dispcorr: -0.027909024 hartree
energy: -970.294187552009
dipole: -12.64294 12.63622 -0.00672 5.75914 -5.92558 -0.16644 3.13048 -2.76916 0.36132
magnitude: 0.39787 au
magnitude: 1.01131 debye
